program: Gaussian 09
title: 000125745
version: EM64L-G09RevD.01
frameworkgroup: C1[X(C9H10F2N2O5)]
method: RPBEPBE
basis: SDD
operation: Freq
keyword: #p
keyword: freq=noraman
keyword: PBEPBE/SDD
title: #p freq=noraman PBEPBE/SDD
converged: YES YES NO NO
title: Mulliken charges:
elementType: F F O O O O O N N C C C C C C C C C H H H H H H H H H H
charge: -0.211485 -0.158401 -0.283100 -0.430179 -0.424985 -0.255739 -0.207422 -0.179979 -0.409990 -0.165833 -0.096853 -0.047450 -0.138881 -0.336748 0.243039 -0.135011 0.167353 0.118511 0.285324 0.285293 0.281344 0.272955 0.230376 0.211105 0.361145 0.295182 0.373162 0.357267
chargesum: 0.00000
title: Mulliken charges with hydrogens summed into heavy atoms:
elementType: F F O O O O O N N C C C C C C C C C
charge: -0.211485 -0.158401 -0.283100 -0.069034 -0.067718 -0.255739 -0.207422 -0.179979 -0.036828 0.119491 0.188440 0.233894 0.134074 0.104733 0.243039 0.160171 0.167353 0.118511
polarizability: 1.73209499e+02 -8.35636007e+00 1.28234468e+02 8.25175768e-01 8.67316086e+00 8.17370780e+01
1716.lowfreq: -12.7094 0.0003 0.0004 0.0009 3.9743 5.0186 26.1583 35.2022 52.3875
frequency: 25.6953 35.0910 52.3668 76.4248 98.9383 110.2184 142.3132 155.8097 171.9292 210.5950 240.7444 254.6260 274.0247 287.3955 300.5993 339.2317 365.7898 375.6930 384.2056 428.7984 441.3461 457.3375 485.4206 524.2216 573.7254 621.7967 686.3078 698.5861 711.6615 721.8337 742.3437 770.6246 779.7900 797.8223 831.1912 869.1417 911.1406 928.9947 952.3570 972.2563 981.4314 998.4058 1036.4087 1071.5607 1074.1745 1114.8237 1131.8329 1174.1019 1187.6005 1202.2754 1212.0303 1261.4453 1263.3983 1279.8325 1297.2270 1309.4402 1313.4645 1324.3212 1342.7727 1364.0239 1367.3688 1373.4854 1382.7525 1431.0151 1466.2304 1632.2426 1649.7088 1676.2082 2974.5342 3010.2467 3038.7392 3076.4135 3093.7816 3109.6703 3220.5997 3520.4593 3543.5682 3551.1289
redmass: 7.7368 7.6988 8.9023 8.7774 3.4901 12.2461 7.0594 7.4848 8.8500 6.3399 5.8354 1.5747 2.8263 13.0399 5.2453 7.1984 4.3071 4.9882 6.9457 1.7947 2.2758 8.7106 5.4666 3.3081 6.8969 6.1192 2.3641 5.0954 7.9530 5.9916 8.1299 3.3684 2.9318 3.8974 4.2770 1.3930 3.2450 3.0846 5.1251 2.8556 3.2752 3.1805 4.2717 2.6747 2.1362 3.7123 5.3012 1.1918 1.6305 1.5514 3.4108 1.4998 1.4711 1.5854 1.2989 1.4633 1.4209 2.8625 1.1898 1.2495 1.9556 1.9618 1.2677 2.0314 1.0871 6.1960 12.4687 6.6631 1.0664 1.0841 1.0859 1.0976 1.0876 1.0900 1.0936 1.0771 1.0658 1.0667
irintensity: 0.4937 1.9267 0.3568 0.8176 7.3643 1.0049 4.3921 6.8055 7.6754 5.5750 14.7910 90.4351 34.7510 1.4468 2.5217 8.8543 18.8619 21.3645 9.1490 53.5368 61.1530 13.2265 5.4095 3.8976 19.7367 0.6067 13.5782 5.6111 1.4297 26.6812 18.1014 10.0902 147.7775 35.6334 11.9580 23.2159 41.6891 9.2457 114.8191 164.8170 22.3386 65.0864 87.7520 37.2222 10.5651 29.8468 97.3503 19.6147 39.4143 34.9971 11.5110 59.4604 78.8610 30.1040 5.7579 21.0474 17.2118 117.3628 27.7940 18.5965 39.4989 7.2375 19.0237 47.9650 6.9930 299.0274 196.9788 514.4556 35.2873 11.7088 18.2387 29.2731 7.7527 6.1759 8.9594 74.2539 9.7666 17.1485
temp: 298.150 k
press: 1.00000 atm
elementType: 9 9 8 8 8 8 8 7 7 6 6 6 6 6 6 6 6 6 1 1 1 1 1 1 1 1 1 1
symmnumber: 1
zpe: 519580.7 jmol-1
zpe.correction: 0.197898 hartree
zpe.thermalcorrener: 0.214758 hartree
zpe.thermalcorrenthalpy: 0.215702 hartree
zpe.thermalcorrgfe: 0.152071 hartree
zpe.sumelectzpe: -1032.886521 hartree
zpe.sumelectthermal: -1032.869661 hartree
zpe.sumelectthermalent: -1032.868717 hartree
zpe.sumelectthermalfe: -1032.932348 hartree
dipole: 4.0092 -2.2965 0.1183
dipole: 4.6219
quadrupole: -121.9688 -116.7501 -105.1027
quadrupole: 4.5507 3.1678 1.9104
quadrupole: -7.3616 -2.1429 9.5045 4.5507 3.1678 1.9104
hfenergy: -1033.0844192 hartree
pointgroup: C01 [X(C9H10F2N2O5)]
dipole: -1.5851691 0.8903318 -0.0323364 debye
polarizability: 173.3520239|-7.9940879|126.2119371|-0.0223416|-12.6099193|83.6170839 unknown
InChI: InChI=1S/C9H10F2N2O5/c10-3-1-13(9(17)12-7(3)16)8-5(11)6(15)4(2-14)18-8/h1,4-6,8,12,14-15H,2H2
charge 0 multiplicity 1
28 atoms
F  -1.120883 0.014642 1.997327
F  2.749746 -2.342505 0.834409
O  -1.45935 -0.24169 -1.051222
O  -3.694226 1.849318 0.079768
O  -2.644763 -2.845753 -1.028797
O  1.235612 2.624023 -1.019791
O  4.686732 -0.369458 0.02625
N  0.645255 0.50545 -0.162928
N  2.918542 1.08679 -0.476515
C  -3.019754 0.654085 0.590656
C  -0.774024 0.834527 -0.301468
C  -1.572698 1.000638 1.011265
C  -2.837638 -0.453205 -0.475699
C  -2.913995 -1.895563 0.047063
C  1.583412 1.491264 -0.590698
C  1.052142 -0.750811 0.296017
C  2.37496 -1.083078 0.375453
C  3.448927 -0.160707 -0.012718
H  -3.618614 0.33139 1.455857
H  -0.800368 1.783482 -0.871054
H  -1.476456 1.994869 1.472554
H  -3.550728 -0.327883 -1.310944
H  -3.940645 -2.118958 0.384738
H  -2.219629 -2.032307 0.902367
H  -3.407661 2.03821 -0.850786
H  0.266627 -1.450272 0.580787
H  3.613027 1.782207 -0.770358
H  -1.777149 -2.603908 -1.445634
