program: Gaussian 09
title: 000125786
version: EM64L-G09RevD.01
frameworkgroup: C1[X(C11H19N3O4P)]
method: RPBEPBE
basis: SDD
operation: Freq
keyword: #p
keyword: freq=noraman
keyword: PBEPBE/SDD
title: #p freq=noraman PBEPBE/SDD
converged: YES YES NO NO
title: Mulliken charges:
elementType: P O O O O N N N C C C C C C C C C C C H H H H H H H H H H H H H H H H H H H
charge: 1.365289 -0.485264 -0.529522 -0.662201 -0.529867 -0.116190 -0.066570 -0.295584 -0.331121 -0.559732 -0.537549 -0.549921 -0.302781 0.330901 -0.308557 -0.385163 -0.253467 -0.306008 0.106249 0.292323 0.293539 0.291106 0.266440 0.264817 0.272008 0.265330 0.277986 0.275169 0.271044 0.267433 0.257721 0.265392 0.429821 0.294537 0.277757 0.297330 0.278470 0.278833
chargesum: 1.00000
title: Mulliken charges with hydrogens summed into heavy atoms:
elementType: P O O O O N N N C C C C C C C C C C C
charge: 1.365289 -0.485264 -0.529522 -0.232380 -0.529867 -0.116190 -0.066570 -0.016751 0.254741 0.262631 0.277776 0.263725 0.220332 0.330901 -0.014020 -0.107406 0.043863 -0.027538 0.106249
polarizability: 2.26369908e+02 2.95576372e+01 1.61996022e+02 -2.03721315e+01 9.49558276e+00 1.49490053e+02
1716.lowfreq: -11.7264 -9.3159 -0.0011 -0.0009 0.0009 4.9516 9.0093 18.3644 28.1346
frequency: 3.5135 16.7892 27.9690 31.6751 36.8176 74.3781 80.3253 87.6209 125.3065 156.7130 172.1602 181.3209 194.0564 200.0348 218.7725 229.4592 257.7780 269.8282 273.0146 301.1165 331.3711 340.1591 342.3222 353.8818 379.5001 413.1873 415.5944 435.3846 451.8996 479.2754 496.8387 505.5554 559.2911 608.5139 634.2386 664.9242 707.9924 726.1081 742.3917 773.0290 804.7375 831.0400 839.1439 844.1141 878.5499 923.7179 929.2092 939.3426 979.1588 980.9758 994.5943 1000.0099 1017.1603 1046.1557 1054.6979 1061.2539 1089.1873 1103.6491 1116.9714 1127.3359 1138.2735 1167.8913 1193.9094 1195.6159 1218.3174 1253.4647 1265.2452 1285.4851 1316.5461 1343.2882 1344.6268 1387.9053 1393.2929 1421.3822 1424.6319 1427.6589 1448.1600 1454.4440 1457.1506 1462.7287 1465.6717 1469.8817 1473.3281 1476.5866 1486.6797 1488.8723 1500.4013 1581.7827 1599.7666 3020.0130 3022.8724 3025.3191 3029.4193 3034.4712 3089.2230 3114.1653 3137.0764 3140.1765 3142.9058 3145.6854 3147.1403 3150.3575 3153.1575 3154.0137 3166.3644 3173.5382 3195.8054 3599.1562
redmass: 5.3506 4.1847 3.1461 3.9934 4.9354 5.7219 1.9836 7.5149 4.9336 2.9323 2.5744 4.3458 1.3991 2.5107 3.2329 7.1434 1.0659 1.1490 2.9529 5.6609 4.5229 3.2228 2.7631 4.0713 8.0683 3.4004 3.9107 2.3661 3.0305 6.9595 3.0506 2.7477 8.6104 6.6991 7.5272 7.2669 3.3257 7.4736 3.8925 6.0636 1.2267 7.3084 1.2980 1.2835 3.3331 2.7410 1.3301 2.7943 6.6926 1.4456 1.4574 2.2999 1.2820 1.1974 1.7380 1.7341 11.1852 1.2928 1.5288 2.0661 1.4532 2.8581 1.8066 1.3715 1.7882 1.9231 1.3754 1.3124 1.2130 2.5241 1.2428 5.9561 1.2471 3.0575 1.1621 1.1496 1.0917 1.0479 2.4225 1.1099 1.0420 1.1343 1.8818 1.1475 1.0525 1.0536 1.0572 7.7601 6.2249 1.0512 1.0387 1.0324 1.0350 1.0572 1.1082 1.1092 1.1058 1.0911 1.1059 1.1051 1.1056 1.1057 1.1050 1.0887 1.0949 1.0977 1.0755 1.0670
irintensity: 2.2423 3.5121 1.4565 1.7541 1.5588 1.4918 1.0697 2.0076 11.6510 40.8816 11.7035 17.7748 11.4607 18.2241 17.6409 26.4907 1.2489 2.5858 22.5881 6.0919 13.2894 5.1609 1.4022 29.4828 27.7937 12.0919 30.5159 1.1898 3.0597 21.0065 4.3980 48.6224 29.4947 28.0564 60.0065 105.1190 9.0692 216.6778 33.1967 85.3236 11.3253 241.8960 24.7217 16.3369 46.7647 9.5616 71.5185 38.0313 140.2398 5.6394 7.3828 9.1040 73.6561 0.0717 0.7195 5.8049 163.1526 16.5591 1.4083 65.8745 0.5303 197.0858 58.6644 3.2323 1.1405 0.2771 0.3491 2.6055 5.5203 58.7387 1.5064 3.5879 1.7936 13.4574 20.3793 16.0011 1.9854 1.7993 19.5710 7.2957 0.6821 22.8471 102.2492 5.6394 43.5293 40.2991 85.4609 7.0838 77.2578 8.8009 12.3267 1.7996 6.5479 3.0964 6.8543 1.8226 0.1692 0.5856 0.3414 1.3028 2.8771 3.1509 6.4220 1.1545 2.8872 2.5981 2.9398 183.3383
temp: 298.150 k
press: 1.00000 atm
elementType: 15 8 8 8 8 7 7 7 6 6 6 6 6 6 6 6 6 6 6 1 1 1 1 1 1 1 1 1 1 1 1 1 1 1 1 1 1 1
symmnumber: 1
zpe: 793393.1 jmol-1
zpe.correction: 0.302187 hartree
zpe.thermalcorrener: 0.324052 hartree
zpe.thermalcorrenthalpy: 0.324996 hartree
zpe.thermalcorrgfe: 0.246737 hartree
zpe.sumelectzpe: -1235.140494 hartree
zpe.sumelectthermal: -1235.118629 hartree
zpe.sumelectthermalent: -1235.117685 hartree
zpe.sumelectthermalfe: -1235.195944 hartree
dipole: -6.2233 12.6784 2.1994
dipole: 14.2936
quadrupole: -90.5486 -70.4211 -113.3251
quadrupole: -12.3762 -6.0329 -9.8580
quadrupole: 0.8830 21.0105 -21.8935 -12.3762 -6.0329 -9.8580
hfenergy: -1235.4426812 hartree
pointgroup: C01 [X(C11H19N3O4P1)]
dipole: -4.358303 -2.9171148 -2.0297701 debye
polarizability: 174.1945061|-43.498727|205.45251|23.8178342|-6.6187535|158.2089665 unknown
InChI: InChI=1S/C11H19N3O4P/c1-14(2,3)8-9-17-19(15,16)18-11-6-4-10(13-12)5-7-11/h4-7,12,15H,8-9H2,1-3H3
charge 1 multiplicity 1
38 atoms
P  -0.690388 2.875479 0.509235
O  -2.0224 1.852034 0.936441
O  0.214863 1.866163 -0.602096
O  -1.431669 3.866948 -0.655141
O  0.03982 3.496314 1.75791
N  -2.994684 -1.559434 -0.447047
N  3.320785 -2.733012 0.556647
N  3.58198 -3.01017 1.797983
C  -2.442252 -0.42076 0.440551
C  -2.340249 -1.532211 -1.830275
C  -2.648496 -2.886816 0.235679
C  -4.512712 -1.451351 -0.587712
C  -2.686344 1.011447 -0.077769
C  0.998394 0.745471 -0.200737
C  1.381002 0.49451 1.141872
C  1.391757 -0.105488 -1.258925
C  2.142995 -0.654036 1.425886
C  2.166266 -1.244873 -0.961957
C  2.52816 -1.533681 0.377747
H  -2.908716 -0.531628 1.434201
H  -1.357273 -0.593146 0.540642
H  -1.246014 -1.507122 -1.707121
H  -2.639022 -2.437647 -2.380213
H  -2.675752 -0.641832 -2.381348
H  -3.102043 -2.904613 1.238227
H  -3.044183 -3.71646 -0.369813
H  -1.554394 -2.972097 0.319469
H  -4.967244 -1.443753 0.414806
H  -4.769099 -0.525463 -1.122165
H  -4.880382 -2.318274 -1.157849
H  -2.258921 1.184876 -1.081377
H  -3.750238 1.299337 -0.068889
H  -1.011829 4.746542 -0.834898
H  1.122326 1.199224 1.940378
H  1.128904 0.159433 -2.287587
H  2.466776 -0.879439 2.447259
H  2.516516 -1.916377 -1.752632
H  4.168659 -3.881397 1.803918
