program: Gaussian 09
title: 000125711
version: EM64L-G09RevD.01
frameworkgroup: C1[X(C8H7FN2O3)]
method: RPBEPBE
basis: SDD
operation: Freq
keyword: #p
keyword: freq=noraman
keyword: PBEPBE/SDD
title: #p freq=noraman PBEPBE/SDD
converged: YES YES NO NO
title: Mulliken charges:
elementType: F O O O N N C C C C C C C C H H H H H H H
charge: -0.160992 -0.237462 -0.250763 -0.211863 -0.161189 -0.413547 -0.074851 -0.471631 -0.270819 0.247636 -0.151575 -0.109072 0.172909 0.114846 0.289031 0.255962 0.243987 0.257612 0.296374 0.263702 0.371705
chargesum: 0.00000
title: Mulliken charges with hydrogens summed into heavy atoms:
elementType: F O O O N N C C C C C C C C
charge: -0.160992 -0.237462 -0.250763 -0.211863 -0.161189 -0.041842 0.214180 0.028318 -0.013207 0.247636 0.144800 0.154629 0.172909 0.114846
polarizability: 1.43683964e+02 -6.70641618e-02 1.05127934e+02 -3.48913097e+00 2.66033168e-01 7.08807354e+01
1716.lowfreq: -11.5296 -7.2048 -0.0013 -0.0010 -0.0006 3.7287 37.4761 70.5812 77.1707
frequency: 37.2574 70.5727 77.1537 120.6252 175.0059 187.3837 274.8369 287.0705 301.6275 372.7669 378.1567 424.1208 454.6356 481.4726 542.6939 616.3553 678.0162 687.8994 698.2260 712.9959 715.6073 745.0310 776.2380 811.3304 831.5589 873.2705 881.2536 888.6540 933.0274 980.8894 998.8545 1014.3596 1103.4329 1124.3351 1127.7146 1156.4781 1199.7320 1255.4830 1258.3846 1272.8247 1319.3331 1324.9584 1362.3888 1372.8659 1426.8588 1471.4363 1615.2093 1633.3095 1649.2997 1675.1479 3002.2754 3051.6651 3112.7564 3179.1830 3210.0164 3242.9299 3521.0229
redmass: 5.4783 7.0439 4.2515 9.8335 8.0525 4.5593 7.6188 13.9718 5.8008 4.0717 11.7242 2.6492 9.9536 4.9346 7.3175 6.2237 4.5093 2.6525 3.6049 1.8749 2.9495 7.2448 2.0646 6.9602 3.1485 2.6046 1.5616 1.4897 2.5172 2.0785 4.6975 2.6405 2.6909 2.4641 1.5027 1.5372 5.0970 1.3625 2.5322 1.3707 2.4133 1.5830 1.9166 1.7957 2.3897 1.0973 5.7297 6.0210 12.3938 6.5476 1.0603 1.1035 1.0885 1.0947 1.0882 1.1110 1.0770
irintensity: 0.8049 0.8687 0.0054 1.7702 7.2554 0.3204 5.9279 1.2099 2.1381 2.5655 12.5396 11.0185 5.7611 3.7039 34.2961 1.2542 12.6861 24.3302 33.3724 46.6821 24.5601 12.5985 118.2054 6.3046 5.8944 57.9957 7.0140 27.6483 37.6868 7.0378 158.2192 6.7034 77.9041 35.0226 27.7346 51.9180 27.1634 16.9620 242.2788 24.6389 76.4208 6.3631 39.9189 4.6970 55.5321 10.5408 63.5463 296.4392 230.9154 460.1347 18.9411 14.4334 5.8331 9.8201 0.3745 4.0049 68.6372
temp: 298.150 k
press: 1.00000 atm
elementType: 9 8 8 8 7 7 6 6 6 6 6 6 6 6 1 1 1 1 1 1 1
symmnumber: 1
zpe: 386979.9 jmol-1
zpe.correction: 0.147393 hartree
zpe.thermalcorrener: 0.159075 hartree
zpe.thermalcorrenthalpy: 0.160019 hartree
zpe.thermalcorrgfe: 0.108541 hartree
zpe.sumelectzpe: -743.035566 hartree
zpe.sumelectthermal: -743.023884 hartree
zpe.sumelectthermalent: -743.022940 hartree
zpe.sumelectthermalfe: -743.074418 hartree
dipole: -5.0701 -0.8515 1.7748
dipole: 5.4388
quadrupole: -87.3682 -87.4813 -78.1427
quadrupole: 12.3026 -3.1859 1.6873
quadrupole: -3.0375 -3.1506 6.1881 12.3026 -3.1859 1.6873
hfenergy: -743.182959 hartree
pointgroup: C01 [X(C8H7F1N2O3)]
dipole: -1.9815212 -0.3372273 0.7338798 debye
dipolederiv: -0.2612497 0.1529942 0.0131135 0.4033922 -0.8692289 -0.0426971 0.016867 -0.030613 -0.1130658 -0.9535958 -0.3189405 0.2210127 -0.5406334 -0.580639 0.2625676 -0.282435 -0.0680613 -0.4397423 -0.5871139 0.1659491 0.0192196 0.1814727 -1.2976061 -0.0170883 0.0147938 -0.0357898 -0.360399 -1.344534 0.2116388 0.0646617 0.0365144 -0.4577428 -0.0046282 0.0549609 -0.0130863 -0.3464475 -1.17572 -0.4227257 0.0521646 0.6400191 -1.0084488 -0.0495003 0.1073491 -0.0068054 -0.1793171 -0.940664 0.4238496 0.0451615 0.4699644 -0.7594681 -0.0318509 0.0364857 -0.0294068 -0.3536793 1.5458194 0.1452477 -0.0400303 -0.0735047 0.246002 0.0376487 0.3673266 0.1490062 0.3353148 -0.0556044 -0.1537065 0.0781056 -0.1981073 0.033375 0.0379113 -0.0179515 0.0349315 -0.0650299 -0.2709368 0.1514481 -0.0217018 0.1432243 -0.1566743 0.0473532 0.2642305 0.152652 -0.2232359 1.2286809 0.0281514 -0.0524247 -0.060332 1.8522819 0.0126597 -0.0925323 0.0186959 0.3124846 0.4572575 -0.0663471 -0.0309175 -0.8018884 0.3497132 0.0665853 -0.0019416 0.0181224 -0.007662 0.3830177 0.3743946 -0.2005165 0.5840579 0.3534718 -0.2824739 -0.3096077 -0.1954573 0.3908244 -0.5023917 -0.2259002 0.0275568 -0.7020052 0.8586545 0.063235 0.0093182 0.0420898 0.0042729 1.8042371 -0.3199707 -0.0944239 -0.0310726 0.9048431 0.0103594 -0.0827943 0.0260289 0.294798 0.089259 -0.0302698 0.0069196 0.0560945 0.0398787 -0.016525 -0.0118875 -0.0022474 0.0770209 0.0221644 0.0534067 0.0402156 0.0682243 -0.0079164 -0.1257384 0.0548264 -0.0584706 0.0267438 0.0068007 0.0392853 -0.1427466 0.0430512 0.0597743 0.0411827 -0.1114606 0.0215272 0.0102375 0.1025951 -0.1118077 0.0261651 -0.1459704 0.0740489 0.0229267 0.020462 0.0292241 0.0972748 0.1374343 -0.0665212 0.0031533 -0.0251548 0.0632453 0.0047807 -0.0042356 0.0054431 0.1549414 0.1227196 -0.0748131 -0.0245558 -0.1159486 0.1093167 -0.0296747 -0.0455243 -0.051344 0.045046 0.1918245 0.0446366 0.0098675 0.0686028 0.1931188 -0.0070336 0.0137503 -0.0064394 0.3396196 unknown
polarizability: 143.4645895|-0.3661633|105.0604263|-5.2575908|1.6397062|71.1676183 unknown
InChI: InChI=1S/C8H7FN2O3/c9-5-4-11(6-2-1-3-14-6)8(13)10-7(5)12/h1,3-4,6,10H,2H2
charge 0 multiplicity 1
21 atoms
F  1.946766 -2.521232 -0.099136
O  -2.284176 0.210869 -1.144031
O  0.305513 2.740667 0.097766
O  3.828043 -0.340704 -0.151789
N  -0.232404 0.440245 0.103445
N  2.022576 1.151899 -0.023652
C  -1.678992 0.728651 0.129401
C  -2.452034 0.027029 1.291323
C  -3.320127 -0.994903 0.564225
C  0.673466 1.53778 0.055984
C  0.20997 -0.883348 0.038417
C  -3.185586 -0.819239 -0.773783
C  1.539507 -1.190665 -0.040373
C  2.585941 -0.160593 -0.079301
H  -1.770624 1.823851 0.116185
H  -3.063671 0.76383 1.842849
H  -1.755348 -0.428284 2.019167
H  -3.962503 -1.724488 1.055345
H  -0.556454 -1.66274 0.041554
H  -3.65145 -1.321619 -1.620804
H  2.694885 1.926094 -0.051493
