program: Gaussian 09
title: 000125720
version: EM64L-G09RevD.01
frameworkgroup: C1[X(C19H22N4O2)]
method: RPBEPBE
basis: SDD
operation: Freq
keyword: #p
keyword: freq=noraman
keyword: PBEPBE/SDD
title: #p freq=noraman PBEPBE/SDD
converged: YES YES NO NO
title: Mulliken charges:
elementType: O O N N N N C C C C C C C C C C C C C C C C C C C H H H H H H H H H H H H H H H H H H H H H H
charge: -0.245123 -0.205875 -0.087330 -0.153902 -0.404710 -0.412612 -0.161107 -0.059255 0.004207 -0.521338 -0.469359 -0.625032 0.374812 -0.216940 0.369770 -0.437828 -0.650190 0.230581 -0.455605 -0.453740 -0.372640 -0.215759 -0.458063 0.241079 0.164610 0.243030 0.210427 0.230109 0.216341 0.225133 0.210375 0.180744 0.223802 0.235503 0.219763 0.253695 0.218871 0.246807 0.192734 0.226181 0.263704 0.302686 0.227166 0.215515 0.264825 0.261932 0.352007
chargesum: 0.00000
title: Mulliken charges with hydrogens summed into heavy atoms:
elementType: O O N N N N C C C C C C C C C C C C C C C C C C C
charge: -0.245123 -0.205875 -0.087330 -0.153902 -0.102023 -0.060605 0.081923 0.151172 0.234316 -0.079864 -0.078240 -0.165726 0.374812 -0.216940 0.369770 0.035629 0.008222 0.230581 -0.229425 -0.190036 -0.145475 -0.000244 0.068695 0.241079 0.164610
polarizability: 2.73848462e+02 1.31795445e+01 2.51288236e+02 4.65488078e+00 -1.16466453e+01 1.62856652e+02
1716.lowfreq: -6.2833 -2.8389 -1.4043 -1.1127 -0.7109 8.3900 16.6687 26.5646 31.9330
frequency: 16.6122 26.5122 31.8733 55.9655 75.4622 107.5920 131.5658 139.8772 160.7059 182.6659 197.2038 209.7243 220.9670 241.6802 252.8760 282.8326 287.1449 307.9683 328.8666 343.5237 371.8854 380.9313 413.0369 442.8468 459.2775 472.6096 494.1575 506.7701 510.8681 539.0695 547.8292 559.4778 582.2946 598.1686 600.8568 612.4870 625.6138 655.8591 669.0711 713.1002 732.2830 738.5726 753.0151 774.5861 786.3980 804.6602 809.6224 833.7847 869.3940 876.7100 878.2123 891.2243 899.1672 936.9440 952.9404 981.8271 992.5062 994.3733 1034.1773 1042.0790 1045.5834 1051.4048 1075.4460 1091.4197 1097.7826 1103.5887 1115.1792 1120.1110 1128.0732 1147.7516 1151.1279 1164.5017 1175.0425 1188.1303 1203.1324 1222.7153 1226.0686 1236.0793 1237.9565 1251.1521 1267.5523 1274.2784 1278.8692 1283.3269 1291.9537 1294.6518 1302.1577 1308.0355 1324.7433 1328.4886 1342.7462 1351.3925 1356.9667 1371.3788 1377.9687 1400.0537 1408.1083 1418.5871 1433.9790 1451.8891 1458.0869 1460.9082 1462.8377 1467.2628 1471.7736 1479.5832 1488.7295 1503.5128 1567.5552 1619.1819 1627.9971 1684.1252 1710.9862 2815.8957 2826.9395 2864.2785 2939.9144 2957.6387 2965.8942 2966.0254 2974.0957 2989.3294 3008.2701 3034.1961 3035.6955 3040.3125 3044.3483 3051.1641 3092.8637 3124.3308 3140.6540 3157.1751 3217.8985 3594.2831 3613.9966
redmass: 7.3528 6.8092 6.0692 4.7821 3.6001 4.8409 3.0312 2.7057 4.5733 6.4575 3.6618 2.0497 2.8876 3.5667 2.8762 2.4776 2.3120 3.1521 2.9048 5.2693 2.9162 6.3351 2.6300 3.6630 3.1022 3.1441 1.6098 2.5215 2.8206 2.2046 3.4251 4.8539 4.2536 4.0505 4.8440 3.2853 3.5355 1.3474 7.0611 7.7443 4.9195 4.0260 1.6314 1.9970 2.2322 2.4503 3.2709 4.5628 2.1488 3.0631 1.6830 1.4885 2.7970 2.1034 1.3221 1.8045 2.2283 3.0296 2.5179 2.1310 2.8149 2.8715 2.3419 1.8850 2.4321 2.2102 1.9651 2.1501 2.5722 1.7301 1.6957 1.4006 1.2464 1.7342 1.5106 1.9282 1.7821 1.5582 1.6776 1.6988 1.6136 2.3345 1.9214 1.5941 1.4806 1.6932 1.6624 1.7006 1.4864 1.3737 1.5273 2.1407 1.5155 1.4113 1.4606 2.3188 2.5006 3.8553 1.1724 2.9350 1.1580 1.0931 1.1877 1.1499 1.1073 1.0729 1.0645 3.2292 6.8874 7.3569 8.2528 7.7231 12.0059 1.0730 1.0760 1.0573 1.0813 1.0665 1.0700 1.0699 1.0670 1.0589 1.0879 1.0772 1.0982 1.1035 1.0945 1.0962 1.0985 1.0855 1.0916 1.0982 1.0982 1.0804 1.0808
irintensity: 0.0636 0.8795 0.3219 0.9282 1.7183 1.2303 0.3387 1.3619 5.4959 4.0600 11.2355 1.4821 0.2302 5.5596 2.7756 0.8616 1.9351 1.2521 0.8090 16.2000 7.8138 13.0627 1.3599 1.1552 0.5673 1.9453 68.6151 17.8970 25.6905 11.9905 3.9633 2.5408 8.1624 4.5167 9.3656 3.3443 6.3255 98.4131 6.8252 56.1891 1.8204 3.6204 68.6037 35.6058 3.5912 4.1978 5.2933 3.8525 2.9356 8.5310 1.1924 5.2374 21.8630 0.6896 1.2642 8.2914 1.6506 3.0870 26.4110 14.2302 47.7356 0.5522 6.6860 28.8245 14.9348 8.6202 28.0119 48.6829 16.9013 10.1319 6.1303 3.7681 1.7428 11.5720 9.3299 27.2331 2.4921 4.6232 71.4628 13.0377 23.2254 55.2416 36.2850 7.2429 22.9843 32.4741 21.1490 16.4386 16.9296 1.4140 21.4963 26.4022 13.1769 4.2986 0.3539 87.1066 3.7418 9.0163 2.5129 17.7730 37.3755 18.0556 1.1234 23.8935 15.5223 6.9583 26.3715 1.3638 3.4219 12.0033 6.5678 690.3076 169.8172 42.5871 74.5813 147.0079 11.9072 49.9931 19.0008 22.0784 29.2847 23.7763 53.4001 40.3499 37.7101 11.6870 37.4558 18.9847 31.8805 2.0581 25.0607 30.7382 1.8394 72.6839 63.4021
temp: 298.150 k
press: 1.00000 atm
elementType: 8 8 7 7 7 7 6 6 6 6 6 6 6 6 6 6 6 6 6 6 6 6 6 6 6 1 1 1 1 1 1 1 1 1 1 1 1 1 1 1 1 1 1 1 1 1 1
symmnumber: 1
zpe: 1012623.4 jmol-1
zpe.correction: 0.385688 hartree
zpe.thermalcorrener: 0.406757 hartree
zpe.thermalcorrenthalpy: 0.407701 hartree
zpe.thermalcorrgfe: 0.334655 hartree
zpe.sumelectzpe: -1104.893954 hartree
zpe.sumelectthermal: -1104.872884 hartree
zpe.sumelectthermalent: -1104.871940 hartree
zpe.sumelectthermalfe: -1104.944987 hartree
dipole: 4.0387 2.8770 -0.1572
dipole: 4.9611
quadrupole: -134.3976 -134.9347 -165.1209
quadrupole: -12.4726 -2.6693 -2.9282
quadrupole: 10.4201 9.8830 -20.3032 -12.4726 -2.6693 -2.9282
hfenergy: -1105.2796417 hartree
pointgroup: C01 [X(C19H22N4O2)]
dipole: 1.5709239 1.1574018 -0.0485165 debye
polarizability: 273.2763343|13.7145642|251.6014251|6.1369866|-11.8667722|163.1155908 unknown
InChI: InChI=1S/C19H22N4O2/c1-22-8-11(9-23-10-17(24)21-19(23)25)5-14-13-3-2-4-15-18(13)12(7-20-15)6-16(14)22/h2-4,7,11,14,16,20-21H,5-6,8-10H2,1H3
charge 0 multiplicity 1
47 atoms
O  -3.901993 -0.797948 2.255763
O  -5.716076 -1.610887 -2.029302
N  0.649084 2.857549 -0.218633
N  -3.68343 0.357516 0.180793
N  5.270125 -1.081377 -0.012255
N  -4.962653 -1.497029 0.22327
C  0.796055 0.363933 -0.350474
C  1.516379 1.684381 0.11549
C  -1.449857 1.513178 -0.038812
C  -0.614853 0.255781 0.2681
C  -0.681327 2.762819 0.431776
C  2.932559 1.848263 -0.524895
C  1.662262 -0.867341 -0.074681
C  3.056569 -0.653229 -0.107399
C  3.741883 0.591903 -0.316009
C  -2.84457 1.474279 0.630362
C  1.270388 4.169312 0.073727
C  4.012375 -1.693098 0.085172
C  1.235378 -2.187486 0.172712
C  5.103067 0.304731 -0.249109
C  3.584652 -3.02091 0.321128
C  2.18869 -3.238239 0.36335
C  -4.197468 0.200787 -1.185498
C  -4.137814 -0.64364 1.03255
C  -5.064545 -1.073661 -1.103922
H  0.679332 0.46549 -1.452662
H  1.655834 1.610453 1.228494
H  -1.568249 1.605397 -1.13912
H  -1.12922 -0.644347 -0.118476
H  -0.529917 0.125281 1.366667
H  -1.252055 3.675604 0.172395
H  -0.590895 2.733891 1.551526
H  3.450697 2.718682 -0.084721
H  2.792055 2.06384 -1.604554
H  -3.377942 2.42936 0.438883
H  -2.738578 1.360293 1.725282
H  0.540335 4.9670 -0.151417
H  2.150095 4.338304 -0.567344
H  1.586187 4.282585 1.141506
H  0.169545 -2.433853 0.226303
H  5.969865 0.956483 -0.344856
H  6.16772 -1.550107 0.084252
H  4.285264 -3.849495 0.470953
H  1.819414 -4.253243 0.550455
H  -3.395944 0.058424 -1.934467
H  -4.817471 1.060509 -1.505613
H  -5.425354 -2.319936 0.609111
