program: Gaussian 09
title: 000125713
version: EM64L-G09RevD.01
frameworkgroup: C1[X(C32H26N2)]
method: RPBEPBE
basis: SDD
operation: Freq
keyword: #p
keyword: freq=noraman
keyword: PBEPBE/SDD
title: #p freq=noraman PBEPBE/SDD
converged: YES YES NO YES
title: Mulliken charges:
elementType: N N C C C C C C C C C C C C C C C C C C C C C C C C C C C C C C C C H H H H H H H H H H H H H H H H H H H H H H H H H H
charge: -0.173387 -0.173387 0.450032 0.450027 0.542084 0.542081 0.510504 0.510505 -0.373659 -0.373657 -0.376075 -0.376075 -0.381348 -0.381348 -0.400147 -0.400145 -0.326066 -0.326063 -0.299932 -0.299935 -0.391713 -0.404825 -0.404825 -0.391713 -0.149416 -0.149418 -0.148361 -0.148362 -0.176210 -0.176209 -0.175821 -0.175819 -0.151635 -0.151634 0.264323 0.264323 0.266403 0.266404 0.246977 0.246978 0.255994 0.255994 0.233323 0.233321 0.223059 0.223060 0.233681 0.239544 0.239543 0.233681 0.302079 0.302081 0.302497 0.302499 0.281815 0.281815 0.282129 0.282128 0.294150 0.294150
chargesum: 2.00000
title: Mulliken charges with hydrogens summed into heavy atoms:
elementType: N N C C C C C C C C C C C C C C C C C C C C C C C C C C C C C C C C
charge: -0.173387 -0.173387 0.450032 0.450027 0.542084 0.542081 0.510504 0.510505 -0.109336 -0.109334 -0.109672 -0.109670 -0.134371 -0.134370 -0.144152 -0.144151 -0.092744 -0.092742 -0.076873 -0.076875 -0.158032 -0.165282 -0.165282 -0.158032 0.152663 0.152663 0.154136 0.154137 0.105605 0.105606 0.106308 0.106309 0.142516 0.142516
polarizability: 1.95706857e+03 -3.65172278e+00 2.93217326e+02 7.26296887e-04 1.48684408e-04 1.64195997e+02
1716.lowfreq: -1.4041 -0.0022 0.0006 0.0025 2.3457 6.4503 9.5014 15.8504 18.6500
frequency: 9.5009 15.8338 18.6083 25.3288 32.0179 43.9656 47.4644 72.7369 73.4713 84.9750 94.6258 98.4535 106.4027 124.4305 132.5401 173.6863 208.3751 222.0565 230.9094 238.3901 269.9087 315.0183 321.5334 339.8693 363.5149 383.2948 399.3640 400.0109 402.2653 410.3291 410.5955 419.7089 428.3379 455.9297 477.8612 506.6210 507.7473 518.2789 544.1052 546.9787 562.5510 602.4357 625.8090 627.8265 635.8209 638.0191 642.1679 642.9678 688.1466 688.1581 717.4625 719.0875 725.0580 726.5202 749.7593 780.9044 781.7039 806.7727 819.5206 824.5654 825.5476 829.4870 830.5745 839.6965 850.8653 856.9921 858.9004 861.5215 877.1543 903.1803 908.5690 944.7678 945.0049 956.7764 960.5462 969.6335 971.7479 972.5433 980.6185 985.1971 985.2117 987.9771 988.4616 988.4670 995.5125 1002.6952 1003.4683 1004.1373 1018.2738 1018.2769 1028.8403 1028.8432 1049.5084 1049.5087 1089.2953 1089.2991 1127.4269 1132.9969 1134.7480 1182.9569 1182.9586 1191.2328 1198.3813 1199.4491 1211.5293 1212.6894 1214.1980 1216.6160 1240.5412 1244.3507 1256.9405 1264.6369 1299.5758 1303.0224 1304.0150 1310.8691 1316.4650 1319.3118 1336.6283 1337.6611 1346.4061 1352.9987 1353.0798 1378.1659 1387.2862 1398.9135 1430.8515 1431.8826 1435.2721 1467.2103 1467.9345 1470.5313 1470.6365 1489.9278 1494.3703 1512.6103 1547.7210 1550.6402 1552.1711 1572.5249 1572.6267 1585.1497 1590.5664 1610.4199 1624.4640 1625.8543 1634.8047 1635.7078 3099.0752 3099.4449 3116.1297 3116.3073 3129.1297 3129.5893 3140.5804 3140.5906 3142.8697 3142.8796 3154.7685 3158.9086 3159.6751 3159.6933 3168.4772 3168.4858 3178.7051 3178.7230 3189.0819 3189.0857 3197.1440 3197.1481 3209.8079 3209.8133 3215.4873 3215.5033
redmass: 6.4514 3.6443 6.2421 5.2893 3.7271 5.8203 5.7451 3.7045 3.7360 5.4189 5.3473 6.9586 4.6330 4.3866 3.3195 5.2619 2.2302 4.4887 4.9571 4.3627 4.7587 3.7498 5.2671 4.6881 3.4624 5.6737 2.7802 2.8286 2.7290 2.9483 3.0353 3.8810 4.8847 4.2493 3.8447 3.3779 3.8863 3.0533 7.2792 2.7137 2.5210 7.1034 6.9910 6.8815 6.6949 6.4464 6.2536 6.3034 1.9740 1.9733 3.4688 5.5406 3.5167 5.1560 2.9761 1.6082 1.6581 5.0959 1.4005 1.2706 1.6302 3.0564 1.4141 1.4563 1.6657 1.7777 1.2768 2.0997 4.2507 1.9451 2.0517 1.3460 1.3534 1.2926 1.3598 1.3757 1.3962 1.4191 1.3666 1.4346 1.4328 1.2283 4.9868 5.3244 1.2501 3.1073 3.4869 3.1415 1.3585 1.3585 4.1323 4.1251 1.9440 1.9436 1.7487 1.7483 1.4933 1.4454 1.4522 1.0707 1.0707 1.7491 1.2443 1.1387 1.4308 1.3844 1.4747 1.7595 2.0189 2.4875 1.7093 1.4590 2.0310 2.7509 1.4745 1.9108 2.9098 2.3998 1.8151 1.6525 1.3714 1.2592 1.2542 3.8388 3.6426 3.0426 4.1046 3.9312 3.5397 1.8679 1.8758 2.6394 2.6263 2.3484 2.4633 2.7339 5.5869 5.1408 5.2098 6.4670 6.7772 4.9463 5.2639 5.5957 5.3676 5.6387 5.0765 5.3287 1.0911 1.0912 1.0876 1.0875 1.0889 1.0880 1.0885 1.0885 1.0893 1.0893 1.0951 1.0965 1.0971 1.0971 1.0962 1.0962 1.0902 1.0902 1.0915 1.0915 1.0969 1.0969 1.0974 1.0974 1.1018 1.1018
irintensity: 3.6542 0.0677 2.8141 0.0682 0.1533 0.3800 0.0322 20.3569 0.0022 0.2891 0.0302 0.0013 0.1204 0.0635 0.5835 3.1820 0.0040 3.8589 0.2994 0.7697 0.2455 0.0967 0.8894 1.2798 0.2959 1.0703 0.0019 9.8569 0.0008 0.0100 29.8322 0.0247 0.3652 5.0817 3.9056 1.7549 4.0015 2.8987 0.0004 2.1792 68.9227 5.5474 0.0055 0.0015 0.1646 0.0258 0.2680 1.3984 48.0987 49.8646 3.5128 50.4256 13.1234 1.4743 2.0465 105.7188 56.1507 17.0858 0.0021 29.9712 1.4063 0.2154 1.0777 1.5732 121.2921 4.9234 0.1045 37.3604 0.0618 0.3680 4.0347 1.3445 1.8369 0.6128 11.5273 0.1773 0.0816 0.0878 8.9308 5.7032 0.2516 96.9474 2.2975 0.0779 0.0872 24.7785 0.0070 3.8201 0.1341 0.1356 0.1500 24.4643 0.0004 0.5873 3.7738 5.7505 15.8385 0.0941 10.4316 0.9993 0.9879 0.0311 479.3415 0.0077 302.0674 0.0001 0.0114 5.5819 255.3867 0.0117 100.8524 0.0000 16.4094 0.0000 0.1753 23.7565 0.6329 21.2461 0.1195 44.3859 0.0933 3.4605 1.1720 175.6850 1.4182 93.9908 49.1631 0.1941 36.2313 576.4230 0.0016 39.1157 33.8312 0.3443 0.1643 2.8480 0.3863 14.6594 0.1754 0.2977 82.3897 0.0293 2788.4829 0.0157 93.2695 0.0034 224.7652 0.0054 16.8261 0.0022 0.0051 63.6493 16.6308 0.0000 11.5559 0.0148 6.5287 2.4286 18.8440 0.0007 6.8501 0.0531 3.0198 0.0614 16.4060 0.9348 0.0201 0.0201 0.9505 0.7457 4.7293 5.2485 18.3406 0.1159
temp: 298.150 k
press: 1.00000 atm
elementType: 7 7 6 6 6 6 6 6 6 6 6 6 6 6 6 6 6 6 6 6 6 6 6 6 6 6 6 6 6 6 6 6 6 6 1 1 1 1 1 1 1 1 1 1 1 1 1 1 1 1 1 1 1 1 1 1 1 1 1 1
symmnumber: 1
zpe: 1273271.9 jmol-1
zpe.correction: 0.484964 hartree
zpe.thermalcorrener: 0.512965 hartree
zpe.thermalcorrenthalpy: 0.513909 hartree
zpe.thermalcorrgfe: 0.421419 hartree
zpe.sumelectzpe: -1341.705614 hartree
zpe.sumelectthermal: -1341.677612 hartree
zpe.sumelectthermalent: -1341.676668 hartree
zpe.sumelectthermalfe: -1341.769159 hartree
dipole: 0.0001 -0.0001 0.3781
dipole: 0.3781
quadrupole: 739.4117 -154.7213 -194.9702
quadrupole: 9.5880 0.0006 -0.0001
quadrupole: 609.5050 -284.6280 -324.8770 9.5880 0.0006 -0.0001
hfenergy: -1342.1905772 hartree
pointgroup: C01 [X(C32H26N2)]
dipole: 0.0000496 -0.000103 0.1487512 debye
polarizability: 1957.0749384|-1.6569049|293.2109444|0.0068525|0.0463058|164.196014 unknown
InChI: InChI=1S/C32H26N2/c1-3-23-33(24-4-1)31-19-15-29(16-20-31)13-11-27-7-9-28(10-8-27)12-14-30-17-21-32(22-18-30)34-25-5-2-6-26-34/h1-26H
charge 2 multiplicity 1
60 atoms
N  -9.586128 -0.040304 0.03388
N  9.586137 0.040335 0.033984
C  -8.134668 0.113408 0.003302
C  8.134674 -0.113333 0.003263
C  -5.302856 0.407263 -0.041749
C  5.302859 -0.407112 -0.042045
C  -1.434041 -0.136781 -0.073909
C  1.434047 0.136982 -0.073823
C  -7.306591 -1.03761 -0.00094
C  7.306616 1.037701 -0.000221
C  -7.566524 1.409644 -0.017256
C  7.566512 -1.409545 -0.018192
C  -5.912344 -0.887012 -0.021355
C  5.912366 0.887139 -0.020767
C  -6.169274 1.544151 -0.041285
C  6.16926 -1.544014 -0.042341
C  -3.855085 0.626346 -0.058239
C  3.855085 -0.626167 -0.058692
C  -2.882694 -0.347281 -0.066659
C  2.882701 0.347473 -0.06643
C  -0.819283 1.15262 -0.075212
C  0.575729 1.280988 -0.075155
C  -0.575722 -1.280785 -0.076155
C  0.81929 -1.152417 -0.076134
C  -10.19994 -0.982768 -0.773205
C  10.199988 0.983312 -0.772472
C  -10.346776 0.75755 0.871499
C  10.346746 -0.758076 0.871107
C  -11.589504 -1.150297 -0.746821
C  11.589552 1.150804 -0.745937
C  -11.740443 0.6319 0.907565
C  11.740414 -0.632469 0.907296
C  -12.381113 -0.334846 0.096662
C  12.381123 0.334795 0.097043
H  -7.743017 -2.040649 0.059995
H  7.743057 2.040693 0.061399
H  -8.200477 2.301917 -0.060131
H  8.200451 -2.301799 -0.061663
H  -5.292293 -1.787846 -0.001844
H  5.292329 1.787969 -0.000661
H  -5.733779 2.548646 -0.075695
H  5.733749 -2.548478 -0.077445
H  -3.547269 1.680219 -0.061023
H  3.54726 -1.680035 -0.062195
H  -3.190932 -1.402541 -0.065559
H  3.190945 1.402731 -0.064585
H  -1.433695 2.058569 -0.075007
H  1.023475 2.282013 -0.074784
H  -1.023468 -2.28181 -0.076576
H  1.433701 -2.058366 -0.076669
H  -9.548419 -1.546197 -1.442495
H  9.548497 1.547183 -1.441419
H  -9.798188 1.447984 1.513661
H  9.798127 -1.448917 1.512802
H  -12.04209 -1.901305 -1.398498
H  12.04217 1.902226 -1.397115
H  -12.310146 1.275636 1.581797
H  12.310088 -1.276653 1.581126
H  -13.468112 -0.449586 0.121043
H  13.468124 0.449503 0.121532
