program: Gaussian 09
title: 000125667
version: EM64L-G09RevD.01
frameworkgroup: C1[X(C2H6N2OS)]
method: RPBEPBE
basis: SDD
operation: Freq
keyword: #p
keyword: freq=noraman
keyword: PBEPBE/SDD
title: #p freq=noraman PBEPBE/SDD
converged: YES YES NO NO
title: Mulliken charges:
elementType: S O N N C C H H H H H H
charge: 0.167330 -0.110104 -0.584344 -0.053345 -0.324377 -0.636896 0.220350 0.213982 0.265283 0.276367 0.276885 0.288867
chargesum: 0.00000
title: Mulliken charges with hydrogens summed into heavy atoms:
elementType: S O N N C C
charge: 0.167330 -0.110104 -0.018591 -0.053345 0.109955 -0.095245
polarizability: 1.03476304e+02 -1.20156332e+01 5.89708343e+01 -4.08800148e+00 -3.80097274e+00 3.79631717e+01
1716.lowfreq: -6.9966 -0.0025 -0.0020 0.0010 7.5022 9.2173 33.4818 91.7436 159.9993
frequency: 29.8952 91.6512 159.9972 189.2298 205.4011 247.7531 317.1193 387.1602 487.7093 608.3396 697.2749 748.9206 925.0757 1016.8606 1093.8049 1109.4955 1223.3761 1275.2795 1307.1354 1367.7295 1428.0291 1475.8346 1512.5203 1637.6643 2920.3549 3013.2170 3045.6790 3112.6292 3511.2061 3643.7045
redmass: 3.3077 2.6086 1.1706 5.3207 3.7206 4.1308 9.6361 5.5379 1.3085 9.3816 5.4318 1.1639 1.4204 2.7667 1.4961 2.4239 1.2397 1.2737 1.0942 1.3269 1.0769 1.0881 13.9284 1.0964 1.0700 1.0625 1.0904 1.1030 1.0450 1.1003
irintensity: 0.6675 1.7584 64.0160 10.6581 2.6710 6.7422 29.9790 8.2792 293.9998 63.8855 6.1119 6.4248 2.4113 0.9612 9.5020 59.6768 1.6394 11.8725 3.9107 14.4354 14.5411 9.1719 545.6639 38.1241 66.0197 13.4722 22.7537 8.3333 5.3733 6.3409
temp: 298.150 k
press: 1.00000 atm
elementType: 16 8 7 7 6 6 1 1 1 1 1 1
symmnumber: 1
zpe: 232016.0 jmol-1
zpe.correction: 0.088370 hartree
zpe.thermalcorrener: 0.096595 hartree
zpe.thermalcorrenthalpy: 0.097539 hartree
zpe.thermalcorrgfe: 0.054524 hartree
zpe.sumelectzpe: -662.028811 hartree
zpe.sumelectthermal: -662.020586 hartree
zpe.sumelectthermalent: -662.019642 hartree
zpe.sumelectthermalfe: -662.062657 hartree
dipole: -3.0088 -0.7580 -0.3014
dipole: 3.1174
quadrupole: -42.9114 -43.1302 -43.1382
quadrupole: 3.3444 3.2640 -0.6122
quadrupole: 0.1485 -0.0702 -0.0783 3.3444 3.2640 -0.6122
hfenergy: -662.1171811 hartree
pointgroup: C01 [X(C2H6N2O1S1)]
dipole: -1.1967993 -0.0469021 -0.2639871 debye
dipolederiv: -0.3081661 0.0732179 0.1917638 0.2845343 -0.1011927 -0.2425234 0.4123139 -0.1008979 -0.5787841 -1.5079489 0.1027104 1.004146 -0.5819663 -0.0478516 0.3558764 0.3930802 -0.0411139 -0.3304536 -0.909559 -0.1799046 -0.0573891 -0.356216 -0.5009216 0.2675537 0.0128881 0.2654609 -0.5719261 1.5766568 -0.1940004 -1.2717769 0.3576285 -0.0048231 -0.1434392 -0.7726856 0.1820559 0.7404024 0.8208835 0.1962184 0.0000272 -0.0467307 0.2115758 -0.0584857 0.1913655 -0.0028791 0.3035473 0.1631817 0.054003 -0.0234832 0.2487778 0.0742766 0.0085408 -0.1116511 0.0016379 0.057322 0.0363967 0.0326981 0.0040141 0.0187756 -0.0624871 -0.0801944 0.0496141 -0.1170093 0.0156654 -0.0957367 -0.1086116 0.0858015 -0.0004431 -0.0013294 0.0736384 0.0838147 0.1238774 -0.1190028 -0.0222755 0.0230039 0.03046 -0.01251 -0.033184 -0.0354454 -0.031928 -0.1185099 0.0380656 0.0118359 -0.0491867 0.0530258 -0.0514007 0.0578926 0.0648284 -0.0090611 0.0703144 -0.0276648 0.1423361 0.0066736 0.0244891 0.0302755 0.2353213 -0.134597 -0.020375 -0.1846853 0.1722574 0.0923954 0.0431779 -0.0410782 0.109275 0.1727232 -0.0757526 -0.1973758 -0.0782512 0.3005715 unknown
polarizability: 101.7204303|5.6338962|41.6849505|-15.3564225|7.3420833|57.0049291 unknown
InChI: InChI=1S/C2H6N2OS/c3-1-2-6-4-5/h1-3H2
charge 0 multiplicity 1
12 atoms
S  0.815903 0.527689 0.988447
O  2.798418 0.236449 -0.978213
N  -3.034695 -0.336232 -0.328863
N  1.673986 -0.173268 -0.690688
C  -1.811393 0.444535 -0.114506
C  -0.755409 -0.429387 0.60039
H  -2.056467 1.312833 0.524299
H  -1.359158 0.849869 -1.048622
H  -0.439104 -1.272831 -0.041393
H  -1.15773 -0.823683 1.546587
H  -3.005793 -1.026238 -1.080843
H  -3.919058 0.166465 -0.260494
