program: Gaussian 09
title: 000125661
version: EM64L-G09RevD.01
frameworkgroup: C1[X(C14H11N)]
method: RPBEPBE
basis: SDD
operation: Freq
keyword: #pfreq=noraman
keyword: PBEPBE/SDD
title: #p freq=noraman PBEPBE/SDD
converged: NO YES NO NO
title: Mulliken charges:
elementType: N C C C C C C C C C C C C C C H H H H H H H H H H H
charge: -0.331068 -0.446458 -0.446463 0.413294 0.413294 0.194434 0.194432 -0.424148 -0.424150 -0.372266 -0.372263 -0.249759 -0.249759 -0.257954 -0.257953 0.248931 0.248929 0.268667 0.244663 0.244664 0.220450 0.220449 0.230996 0.230996 0.229019 0.229018
chargesum: 0.00000
title: Mulliken charges with hydrogens summed into heavy atoms:
elementType: N C C C C C C C C C C C C C C
charge: -0.062401 -0.197528 -0.197534 0.413294 0.413294 0.194434 0.194432 -0.179485 -0.179485 -0.151816 -0.151813 -0.018763 -0.018763 -0.028934 -0.028934
polarizability: 2.32901240e+02 -2.15061605e-04 1.66573665e+02 -1.40914924e-04 -5.87552393e+00 7.25659841e+01
1716.lowfreq: -12.3106 -0.0006 -0.0001 0.0004 4.5836 8.6011 80.9968 85.5656 161.9796
frequency: 80.9667 85.5652 161.9793 200.7083 243.2219 325.9750 341.2128 395.0512 418.9189 431.1154 432.9438 507.3405 518.6749 574.3365 589.2624 615.7275 653.4254 697.3563 713.4768 739.2325 749.8867 764.4814 769.7430 787.6064 817.8154 840.3995 875.1402 880.0215 949.1372 955.6798 986.2372 990.1000 993.7040 1009.5393 1045.2071 1048.7577 1065.3397 1098.6699 1115.6183 1128.6685 1148.0109 1176.3357 1182.3649 1218.8413 1219.5987 1247.6372 1271.2302 1281.5447 1294.9076 1360.3570 1369.7195 1379.4389 1381.6208 1442.9559 1443.0408 1482.3350 1497.9107 1567.3255 1588.5592 1609.1954 1616.1222 3117.0289 3123.0233 3123.2816 3129.8654 3132.9857 3135.5457 3149.0735 3155.0135 3165.1218 3169.2658 3315.1479
redmass: 3.7867 4.2644 4.5582 3.8818 4.5283 3.5553 4.4732 6.3111 4.8975 3.3569 4.6794 2.9253 4.6596 3.3841 4.1272 6.8830 5.5963 5.3361 4.5408 2.4479 1.9018 4.2215 1.5938 2.0582 3.9173 4.3284 1.6736 1.3889 1.4124 1.3798 1.3474 1.3273 7.3100 1.4747 2.0837 2.4251 1.4818 2.1505 1.7642 1.2508 1.2261 1.0602 1.0979 1.8169 1.7353 1.5689 1.3759 1.5692 2.1041 3.4533 2.1917 3.4994 3.4281 2.2394 2.8896 2.7030 2.6776 5.6007 7.3295 5.8459 6.5673 1.0890 1.0874 1.0865 1.0927 1.0886 1.0893 1.0941 1.0934 1.1008 1.0976 1.0760
irintensity: 0.0055 0.9191 1.2250 0.0012 0.1428 0.1296 2.7729 0.7147 0.0174 6.0835 0.0704 0.5376 3.1032 0.0097 12.7885 5.9635 1.2494 3.8616 88.5362 76.2809 0.1426 1.5498 73.8461 1.1953 1.7799 0.6854 0.0084 0.4843 0.1891 0.8530 0.0005 0.1107 2.2788 15.4454 12.9169 3.5844 2.2173 9.5218 31.8258 2.2040 12.9226 0.6677 2.5133 21.3637 0.4789 5.9812 1.7721 0.5181 0.2603 1.3243 0.0000 1.9925 0.6210 17.6716 19.9235 28.6821 3.1264 1.4291 1.9649 0.6284 0.4801 5.4239 2.5321 4.4632 28.6560 1.1065 26.7797 27.5072 10.7230 41.5611 27.5597 11.4925
temp: 298.150 k
press: 1.00000 atm
elementType: 7 6 6 6 6 6 6 6 6 6 6 6 6 6 6 1 1 1 1 1 1 1 1 1 1 1
symmnumber: 1
zpe: 544855.0 jmol-1
zpe.correction: 0.207524 hartree
zpe.thermalcorrener: 0.218086 hartree
zpe.thermalcorrenthalpy: 0.219030 hartree
zpe.thermalcorrgfe: 0.171296 hartree
zpe.sumelectzpe: -593.797590 hartree
zpe.sumelectthermal: -593.787029 hartree
zpe.sumelectthermalent: -593.786085 hartree
zpe.sumelectthermalfe: -593.833819 hartree
dipole: 0.0000 -1.7195 -0.5757
dipole: 1.8133
quadrupole: -74.1120 -84.4232 -92.2456
quadrupole: -0.0001 0.0000 -6.4351
quadrupole: 9.4816 -0.8296 -8.6520 -0.0001 0.0000 -6.4351
hfenergy: -594.0051148 hartree
pointgroup: C01 [X(C14H11N1)]
dipole: -0.0000271 0.6772331 0.2243422 debye
dipolederiv: -0.1184902 0.0000151 0.000014 0.0000117 -0.4076258 -0.1749403 0.0000153 -0.300368 -0.5292616 0.004073 -0.2390314 -0.0060851 -0.1432242 0.184848 -0.0710005 -0.0367154 -0.0098213 0.2312594 0.0040482 0.2390193 0.0060819 0.1432151 0.1848799 -0.0709907 0.0367077 -0.0097986 0.2312659 -0.0270697 0.1583315 0.0028301 0.2279528 0.1300149 0.0530522 -0.0296636 0.0617875 -0.0822611 -0.0270416 -0.15834 -0.0028297 -0.2279636 0.1299774 0.053045 0.0296637 0.0617776 -0.0822596 0.2398926 0.0513459 0.0025262 -0.0963298 -0.1058555 -0.0247485 -0.0543414 0.010907 -0.012959 0.2398898 -0.0513222 -0.0025254 0.0963541 -0.1058521 -0.0247436 0.0543364 0.0109079 -0.0129582 -0.0472665 -0.1592725 0.005015 -0.1701032 0.0251011 -0.0440903 0.0240831 -0.0612064 -0.1445934 -0.0472918 0.1592625 -0.0050117 0.170098 0.025125 -0.0440849 -0.024078 -0.0612017 -0.1445945 -0.1005294 -0.0692652 0.0176147 -0.0477979 0.0477774 -0.0251972 0.0231466 -0.0222835 -0.130255 -0.1005375 0.069256 -0.0176053 0.04779 0.0477891 -0.0251894 -0.0231333 -0.0222743 -0.1302573 0.0312415 0.0074365 0.0251604 -0.0198837 -0.0080772 -0.0135598 0.0180546 -0.0144009 -0.1545506 0.0312419 -0.0074313 -0.0251522 0.0198884 -0.0080773 -0.0135601 -0.0180396 -0.0144008 -0.1545525 -0.0565466 0.0849766 -0.0065588 0.117916 0.0470491 -0.0446526 -0.0054799 -0.028878 -0.154672 -0.0565311 -0.0849852 0.0065594 -0.1179247 0.0470396 -0.044644 0.0054725 -0.0288686 -0.1546743 -0.0404929 0.1062508 -0.0908349 0.0305897 -0.0288331 0.061084 -0.0407058 0.0331772 0.040283 -0.0404879 -0.1062548 0.0908291 -0.0305941 -0.028844 0.0610892 0.0407019 0.0331772 0.040287 0.146161 0.0000017 -0.0000059 0.0000003 0.0192579 0.1839264 -0.0000034 0.1631862 0.1650794 0.0461028 0.0498765 -0.0116885 0.1090315 -0.0687855 0.038888 -0.0254742 0.0267958 0.1429196 0.0461165 -0.0498665 0.0116833 -0.1090224 -0.0687962 0.038884 0.0254688 0.0267945 0.1429216 0.0632185 0.1084556 -0.0208705 0.0727053 -0.0517441 0.0294433 -0.0140669 0.0296702 0.1346647 0.0632313 -0.1084486 0.0208621 -0.0726978 -0.0517596 0.0294368 0.0140602 0.0296626 0.1346671 -0.140625 -0.0094818 -0.0221592 -0.0035289 0.0941135 0.0087847 -0.0243156 0.0135721 0.1569329 -0.1406278 0.0094637 0.0221527 0.0035108 0.0941137 0.0087852 0.024306 0.0135734 0.1569343 0.0141687 -0.0864905 0.0050799 -0.1170493 -0.0714244 0.0274944 0.0086701 0.0292611 0.1553163 0.0141522 0.0864982 -0.0050816 0.1170559 -0.0714117 0.0274887 -0.0086697 0.0292518 0.1553176 unknown
polarizability: 232.9012396|0.0026363|166.5356337|0.001079|-6.1721642|72.6040158 unknown
InChI: InChI=1S/C14H11N/c1-3-7-11-9(5-1)10-6-2-4-8-12(10)14-13(11)15-14/h1-8,13-15H
charge 0 multiplicity 1
26 atoms
N  0.000109 -2.509747 -1.012672
C  0.762116 -1.988715 0.210387
C  -0.761978 -1.988769 0.210355
C  1.467567 -0.678743 0.147537
C  -1.467528 -0.678848 0.147505
C  0.74558 0.543444 -0.055336
C  -0.745625 0.543389 -0.055342
C  2.879903 -0.660083 0.263581
C  -2.879867 -0.660301 0.263532
C  1.499311 1.744392 -0.181655
C  -1.499443 1.744289 -0.181635
C  3.604735 0.54208 0.145214
C  -3.604784 0.541813 0.145175
C  2.904627 1.749337 -0.09099
C  -2.904759 1.749126 -0.090994
H  1.28895 -2.787086 0.743418
H  -1.288772 -2.787182 0.743363
H  0.000105 -1.788722 -1.765243
H  3.409084 -1.605741 0.4313
H  -3.408977 -1.606001 0.43123
H  0.988058 2.69801 -0.343058
H  -0.988257 2.697952 -0.342993
H  4.696937 0.540551 0.227227
H  -4.696988 0.540201 0.227164
H  3.453079 2.691951 -0.195294
H  -3.453284 2.691701 -0.195276
