program: Gaussian 09
title: 000125654
version: EM64L-G09RevD.01
frameworkgroup: C1[X(C9H12N6O4)]
method: RPBEPBE
basis: SDD
operation: Freq
keyword: #p
keyword: freq=noraman
keyword: PBEPBE/SDD
title: #p freq=noraman PBEPBE/SDD
converged: YES YES NO NO
title: Mulliken charges:
elementType: O O O O N N N N N N C C C C C C C C C H H H H H H H H H H H H
charge: -0.270952 -0.433628 -0.430163 -0.280911 -0.224133 -0.082441 -0.038836 0.017247 -0.621604 -0.044801 -0.299456 -0.162729 0.004572 -0.094039 -0.352490 -0.064306 0.050336 -0.353175 0.191816 0.333213 0.250290 0.289146 0.261005 0.263804 0.197546 0.346811 0.314463 0.339740 0.233497 0.319197 0.340982
chargesum: 0.00000
title: Mulliken charges with hydrogens summed into heavy atoms:
elementType: O O O O N N N N N N C C C C C C C C C
charge: -0.270952 -0.086817 -0.090423 -0.280911 -0.224133 -0.082441 -0.038836 0.017247 0.038574 -0.044801 0.033757 0.087561 0.293718 0.166965 0.108861 0.250157 0.050336 -0.119679 0.191816
polarizability: 2.02247022e+02 5.10741532e+00 1.47933741e+02 2.21583386e+01 6.19041412e+00 1.08670600e+02
1716.lowfreq: -14.5948 -5.1638 -0.0010 -0.0009 -0.0005 4.5376 8.9043 28.0088 50.2536
frequency: -13.7880 27.9066 50.2379 52.5266 74.2189 113.5124 124.3413 141.6435 163.1866 188.1864 205.5751 225.5881 272.4129 286.4751 301.9288 315.4981 329.1259 350.0204 358.4191 406.4851 430.8022 440.3765 442.4120 478.6207 527.5075 536.0613 563.2779 570.5144 588.8725 607.4577 695.6227 718.1287 731.8820 737.6400 768.7472 782.7877 791.0683 816.0467 889.4823 923.6143 934.6206 948.1338 962.5161 982.5552 983.4607 1019.5714 1020.5103 1047.8586 1052.2202 1066.9622 1075.7925 1170.8611 1175.6865 1185.2734 1205.8413 1213.8075 1248.6122 1256.6145 1262.2095 1286.2833 1291.7828 1313.6717 1320.8858 1330.6719 1333.3233 1379.6208 1384.1246 1390.4327 1468.4248 1474.0762 1502.8765 1583.7071 1627.6808 1638.5162 2048.5504 2945.8175 3013.0850 3028.4563 3032.9587 3053.0452 3095.2039 3164.8756 3189.0458 3542.1284 3556.5907 3563.1726 3699.8089
redmass: 7.2588 8.2836 6.0800 7.5521 7.2616 3.5134 4.5868 6.0023 6.2736 4.8325 7.8665 5.3766 2.7956 6.7632 1.7905 3.1870 1.5686 3.4090 3.8084 4.8090 3.1469 1.2694 4.2818 13.5073 3.3595 6.7135 8.6318 1.2256 5.4588 6.5222 3.2587 5.3800 6.1099 6.2936 7.6294 1.7330 4.9043 3.9052 4.6220 3.4829 3.2897 4.9408 2.9605 2.0126 1.5407 4.6154 2.2965 2.4851 2.3703 2.1553 2.6493 1.1671 1.7213 2.1613 1.3439 3.8675 1.2431 2.3127 2.7088 1.2769 1.5131 1.2928 1.2985 1.2842 1.5155 1.9341 1.3891 1.3265 1.0781 4.7832 4.6372 2.8288 1.8214 7.1389 13.6009 1.0697 1.0862 1.0859 1.0853 1.0877 1.0939 1.0912 1.0993 1.0453 1.0662 1.0664 1.1045
irintensity: 2.4135 3.9132 0.4679 7.5866 1.3463 6.1732 1.7079 1.9573 9.5423 10.4819 5.1348 11.9763 59.2622 6.3408 47.1100 60.9764 161.4348 7.6031 15.9736 18.0935 3.3249 117.9185 45.8374 3.7911 32.1538 3.6449 8.3406 129.7922 8.7613 6.2230 0.2620 9.7167 8.9491 1.9291 30.0555 59.0368 15.8556 22.8066 14.8541 7.8253 69.6219 106.5601 2.5354 25.3007 9.1206 58.7361 24.4899 24.0195 23.7831 7.5537 103.4520 47.5860 10.6230 39.7287 45.5284 15.6220 23.4548 31.2904 155.6509 10.9439 14.4634 25.0538 3.3404 10.0380 18.1686 39.2317 9.5503 13.0617 5.9514 186.6121 101.9554 174.1761 155.6314 753.6539 292.7432 60.3191 32.6814 30.0787 4.4698 13.9690 14.6968 8.6351 6.5644 113.1883 6.1712 12.5960 39.1511
temp: 298.150 k
press: 1.00000 atm
elementType: 8 8 8 8 7 7 7 7 7 7 6 6 6 6 6 6 6 6 6 1 1 1 1 1 1 1 1 1 1 1 1
symmnumber: 1
zpe: 598731.8 jmol-1
zpe.correction: 0.228045 hartree
zpe.thermalcorrener: 0.245289 hartree
zpe.thermalcorrenthalpy: 0.246233 hartree
zpe.thermalcorrgfe: 0.182656 hartree
zpe.sumelectzpe: -978.059880 hartree
zpe.sumelectthermal: -978.042636 hartree
zpe.sumelectthermalent: -978.041692 hartree
zpe.sumelectthermalfe: -978.105269 hartree
dipole: -2.1055 3.0723 1.1973
dipole: 3.9122
quadrupole: -82.5462 -109.1766 -120.6963
quadrupole: 22.3607 2.5809 -3.0715
quadrupole: 21.5935 -5.0369 -16.5566 22.3607 2.5809 -3.0715
hfenergy: -978.2879249 hartree
pointgroup: C01 [X(C9H12N6O4)]
dipole: -0.8132045 -1.0202315 -0.8166683 debye
polarizability: 191.880524|14.8524238|139.333631|-34.4586488|13.5850591|127.6372074 unknown
InChI: InChI=1S/C9H12N6O4/c10-5-1-2-15(9(18)12-5)8-6(13-14-11)7(17)4(3-16)19-8/h1-2,4,6-8,16-17H,3,10H2
charge 0 multiplicity 1
31 atoms
O  -1.215755 -1.46356 0.736021
O  -3.250009 0.37305 2.159254
O  -2.451843 -2.763358 -1.504791
O  1.402901 1.563738 1.681946
N  0.836236 -0.290172 0.382524
N  -1.241451 1.329418 -0.827109
N  3.080645 0.6218 0.315023
N  -0.310395 2.117864 -1.176856
N  4.661039 -0.291212 -1.114911
N  0.467505 2.839143 -1.704073
C  -1.391906 0.954573 0.609967
C  -2.81551 0.350492 0.760492
C  -0.481674 -0.243236 1.049969
C  -2.62468 -1.135021 0.387283
C  -2.897147 -1.428846 -1.101585
C  1.137452 -1.211621 -0.597356
C  1.809147 0.70076 0.842981
C  2.401941 -1.238308 -1.154981
C  3.370016 -0.29233 -0.641214
H  -1.205954 1.817731 1.273237
H  -3.533017 0.87046 0.096372
H  -0.304632 -0.166631 2.138097
H  -3.256571 -1.766546 1.039357
H  -2.33271 -0.734412 -1.743106
H  -3.984829 -1.290751 -1.291963
H  -3.375123 1.310106 2.45577
H  0.334681 -1.901897 -0.871963
H  -2.84544 -3.443464 -0.900948
H  2.649586 -1.963612 -1.931966
H  4.97072 -0.93704 -1.835568
H  5.307375 0.39558 -0.729204
