program: Gaussian 09
title: 000125697
version: EM64L-G09RevD.01
frameworkgroup: C1[X(C17H27N3O4S2)]
method: RPBEPBE
basis: SDD
operation: Freq
keyword: #p
keyword: freq=noraman
keyword: PBEPBE/SDD
title: #p freq=noraman PBEPBE/SDD
converged: YES YES NO NO
title: Mulliken charges:
elementType: S S O O O O N N N C C C C C C C C C C C C C C C C C H H H H H H H H H H H H H H H H H H H H H H H H H H H
charge: 0.984166 1.019927 -0.543031 -0.546705 -0.565200 -0.552826 -0.111364 -0.351070 -0.473858 -0.129685 -0.118488 -0.479779 -0.367098 -0.409136 -0.385716 0.254535 -0.549548 0.256026 -0.423075 -0.391086 -0.393029 -0.413789 -0.275505 -0.748842 -0.250082 -0.710014 0.196794 0.257703 0.193609 0.278240 0.237912 0.192458 0.216500 0.188943 0.195275 0.214617 0.209564 0.233735 0.236203 0.292305 0.258534 0.233042 0.247647 0.285011 0.227040 0.268873 0.278367 0.343192 0.226030 0.320060 0.283961 0.283133 0.275525
chargesum: 0.00000
title: Mulliken charges with hydrogens summed into heavy atoms:
elementType: S S O O O O N N N C C C C C C C C C C C C C C C C C
charge: 0.984166 1.019927 -0.543031 -0.546705 -0.565200 -0.552826 -0.111364 -0.351070 -0.153798 0.067109 0.139215 -0.007930 0.063273 -0.003693 0.024175 0.254535 -0.106249 0.256026 0.105434 -0.132552 -0.159987 0.118869 -0.048465 0.141590 -0.024052 0.132605
polarizability: 3.19473601e+02 1.52578308e+01 2.86350997e+02 1.13707755e+01 -9.55198342e+00 2.02715275e+02
1716.lowfreq: -6.8543 -0.0020 -0.0018 -0.0009 1.3155 7.3039 26.0719 30.7972 34.3665
frequency: 25.9921 30.5997 34.3065 43.8704 45.8609 72.1727 88.7581 92.1227 98.6007 118.5490 136.5474 154.0920 161.1619 174.6352 177.1954 201.5768 205.9572 211.3214 215.0564 232.9091 246.8015 258.4754 260.3288 271.0285 280.3340 288.9884 305.4727 322.9244 334.4354 339.4293 358.1388 375.5254 402.4334 403.7341 415.6839 423.0213 436.9171 447.3928 471.8041 479.2819 496.2994 512.0044 545.6252 589.3851 596.1080 598.4270 629.7111 655.7976 719.3922 736.4539 764.1441 774.3565 788.8661 799.9279 803.4931 818.7269 825.9079 855.4780 857.7900 875.1339 887.0080 893.5319 894.1927 918.7058 950.7156 953.6586 969.3602 988.4789 989.2564 997.3157 1003.5449 1006.7003 1013.6096 1036.2170 1040.7002 1043.1192 1059.1691 1062.0370 1068.7672 1098.0325 1106.0206 1115.1145 1119.8632 1130.8346 1159.0831 1168.7640 1177.5823 1198.0776 1205.1678 1217.2221 1228.7404 1236.0524 1252.1011 1257.6608 1266.2230 1292.4851 1296.1212 1308.5129 1311.1452 1317.9344 1322.0485 1325.7881 1333.9186 1335.0428 1341.3714 1348.9242 1364.0073 1372.4044 1379.7656 1380.2945 1391.2864 1414.0270 1417.9676 1418.6900 1432.1135 1438.0778 1439.7814 1442.7741 1446.9113 1450.2601 1465.0805 1471.0928 1481.4504 1490.5915 1589.2385 1613.7987 2775.1764 2839.9265 2858.7589 2953.6602 2970.5417 2978.6783 2986.3447 2989.6250 2998.9741 2999.5317 3030.9033 3031.6254 3034.9053 3037.1666 3037.9382 3051.1447 3072.1614 3076.9980 3112.0790 3122.9397 3137.0190 3148.2821 3157.4469 3177.9605 3185.3909 3195.6542 3341.6209
redmass: 5.2773 6.5831 5.2456 6.0049 5.1227 5.1283 4.4182 5.2044 4.7413 3.7755 4.2977 4.5809 2.8521 1.6191 1.3934 2.5484 1.6909 3.6857 5.6235 3.9800 4.0371 2.7019 3.6795 3.7620 3.9253 2.6479 4.4175 2.6353 6.6715 5.3246 5.1821 4.5400 3.6910 4.7450 5.1119 3.5088 3.2514 3.2013 2.6998 3.5939 2.7470 2.2297 3.9329 4.2327 6.7837 4.3154 4.4701 4.1506 3.9957 1.8655 3.4804 1.6410 3.1623 11.4873 10.4511 1.9492 2.2055 2.3069 2.1692 1.3724 2.0281 3.5695 3.7518 2.0572 2.4061 1.5017 2.3685 1.3438 1.3230 1.8738 1.3656 2.3230 1.5879 2.1181 1.6427 2.2507 2.1050 3.5435 2.2097 3.2738 2.2329 2.7705 3.3898 1.6473 2.2452 1.5507 1.1024 1.6520 1.5749 1.1536 1.6389 1.5118 1.4666 1.3623 1.1413 1.4056 1.2678 1.3646 1.2300 1.3117 1.3370 1.2282 1.1908 1.2544 1.4624 1.5504 1.2542 1.2775 1.2667 4.4349 1.4955 1.0504 1.0460 1.0504 1.0740 1.0535 2.2344 1.1367 1.0594 1.0923 1.0851 1.1026 1.1040 2.3404 6.9507 6.2400 1.0778 1.0706 1.0709 1.0632 1.0660 1.0604 1.0773 1.0607 1.0327 1.0579 1.0918 1.0947 1.0935 1.0944 1.0250 1.1000 1.1019 1.0992 1.0867 1.0880 1.0937 1.1061 1.1006 1.1070 1.1075 1.1076 1.0738
irintensity: 0.6806 1.0668 0.4135 7.2386 1.1493 2.0994 0.4813 4.1811 0.4364 2.0233 3.8713 4.1155 3.9474 1.1338 0.4320 2.6643 5.4230 7.9606 0.2229 7.5638 5.0458 4.1972 3.5898 6.9808 9.6332 7.6319 9.4485 5.6339 17.1712 11.8538 8.2830 29.5053 3.1579 25.1863 65.5611 9.7860 7.5606 1.7045 1.4993 1.5835 2.4140 0.5244 1.5938 18.9509 35.4628 12.9119 4.8592 18.1071 3.9332 47.5053 4.7679 31.0791 6.1149 94.8367 41.0882 143.7359 14.1779 28.0158 2.0162 6.1923 1.5171 5.9125 82.9911 8.8503 4.8279 5.3452 10.0043 9.4415 7.4147 12.4737 23.0982 13.3173 46.8141 0.8700 34.5842 8.8336 2.0708 3.3435 35.0034 7.6778 34.2640 3.7386 14.8992 22.9733 11.2560 8.7606 3.2583 2.5112 1.9490 8.8195 1.4448 4.2585 1.9339 21.1212 1.0554 26.9988 12.9165 6.3833 10.4305 1.1484 11.7911 6.0147 9.4440 10.3331 22.9741 23.6580 2.7865 8.9581 12.0147 0.6487 4.9443 12.0051 1.3623 14.5145 16.2369 22.0877 7.0761 13.5963 21.4426 10.8502 5.2474 5.8019 6.8293 24.2981 1.6806 2.6113 45.8500 47.9604 154.4891 16.4891 16.0437 29.5725 4.7074 21.0251 39.6819 37.3208 10.4535 0.3924 61.2706 63.2212 0.0861 3.3465 10.2743 20.6920 9.5515 4.0870 27.3449 34.4598 33.3424 0.7955 0.3360 0.1780 24.7705
temp: 298.150 k
press: 1.00000 atm
elementType: 16 16 8 8 8 8 7 7 7 6 6 6 6 6 6 6 6 6 6 6 6 6 6 6 6 6 1 1 1 1 1 1 1 1 1 1 1 1 1 1 1 1 1 1 1 1 1 1 1 1 1 1 1
symmnumber: 1
zpe: 1120508.9 jmol-1
zpe.correction: 0.426779 hartree
zpe.thermalcorrener: 0.454366 hartree
zpe.thermalcorrenthalpy: 0.455310 hartree
zpe.thermalcorrgfe: 0.368948 hartree
zpe.sumelectzpe: -1922.919520 hartree
zpe.sumelectthermal: -1922.891934 hartree
zpe.sumelectthermalent: -1922.890989 hartree
zpe.sumelectthermalfe: -1922.977352 hartree
dipole: 2.7312 4.4736 1.9465
dipole: 5.5912
quadrupole: -179.9306 -164.0769 -169.8247
quadrupole: -21.6213 3.0593 1.9803
quadrupole: -8.6532 7.2005 1.4527 -21.6213 3.0593 1.9803
hfenergy: -1923.3462992 hartree
pointgroup: C01 [X(C17H27N3O4S2)]
dipole: -0.9120395 -1.8392882 0.7899424 debye
polarizability: 315.9630402|17.9455933|288.6670829|-16.2790177|8.5386|203.9097494 unknown
InChI: InChI=1S/C17H27N3O4S2/c1-25(21,22)18-9-12-20(26(2,23)24)15-8-11-19-10-7-14-5-3-4-6-16(14)17(19)13-15/h3-6,15,17-18H,7-13H2,1-2H3
charge 0 multiplicity 1
53 atoms
S  3.29171 2.230829 -0.629043
S  2.645745 -2.330175 -0.166708
O  2.566618 3.509224 -1.346113
O  4.476564 2.470739 0.472439
O  4.095591 -1.728765 -0.621678
O  1.354654 -2.268706 -1.164608
N  -2.257876 1.928216 0.436895
N  1.96618 1.070655 0.220886
N  2.246788 -1.64875 1.559243
C  -1.819883 0.758183 -0.368289
C  0.585024 1.558444 -0.111205
C  -0.383554 0.365192 0.063055
C  0.067424 2.804042 0.648021
C  -1.381528 3.100479 0.205482
C  -3.698802 2.222236 0.270358
C  -2.793123 -0.422956 -0.258298
C  -4.51663 1.076365 0.888298
C  -4.07829 -0.270717 0.332042
C  2.317804 0.910756 1.65771
C  -2.426481 -1.684602 -0.796823
C  -4.95492 -1.383855 0.384716
C  3.033201 -0.433748 1.9115
C  -3.306902 -2.785019 -0.740225
C  3.942137 1.101193 -2.004985
C  -4.579507 -2.637548 -0.140707
C  2.927073 -4.151916 0.276892
H  -1.766645 1.045794 -1.456761
H  0.609014 1.815757 -1.190092
H  -0.433723 0.059372 1.128077
H  -0.009302 -0.481129 -0.536242
H  0.710251 3.673976 0.423343
H  0.068114 2.626316 1.740119
H  -1.779889 3.952458 0.78622
H  -1.379176 3.405949 -0.873881
H  -3.979182 2.354547 -0.805942
H  -3.921436 3.172829 0.788871
H  -5.596818 1.23112 0.701582
H  -4.36655 1.09363 1.98566
H  1.394078 0.971756 2.262495
H  2.994866 1.721518 2.001559
H  -1.446426 -1.81492 -1.270448
H  -5.946443 -1.256744 0.837706
H  3.2757 -0.522679 2.988936
H  3.990317 -0.466337 1.356378
H  -3.004033 -3.748455 -1.165369
H  3.115439 1.006066 -2.722373
H  4.806002 1.632679 -2.428969
H  4.189816 0.137572 -1.532304
H  -5.272181 -3.48549 -0.094391
H  1.225117 -1.456756 1.510138
H  3.209587 -4.646309 -0.662958
H  3.732285 -4.163247 1.022107
H  1.9766 -4.524865 0.680785
