program: Gaussian 09
title: 000125618
version: EM64L-G09RevD.01
frameworkgroup: C1[X(C10H12F3N3O4)]
method: RPBEPBE
basis: SDD
operation: Freq
keyword: #p
keyword: freq=noraman
keyword: PBEPBE/SDD
title: #p freq=noraman PBEPBE/SDD
converged: YES YES NO NO
title: Mulliken charges:
elementType: F F F O O O O N N N C C C C C C C C C C H H H H H H H H H H H H
charge: -0.152201 -0.172629 -0.182048 -0.255386 -0.428638 -0.445301 -0.250560 -0.209980 -0.044717 -0.620035 -0.128163 -0.008540 -0.551038 -0.045848 -0.378806 -0.184019 0.053346 0.096420 0.142881 0.244364 0.215384 0.290705 0.239753 0.291090 0.288914 0.207580 0.221642 0.366277 0.342095 0.360373 0.351444 0.345640
chargesum: 0.00000
title: Mulliken charges with hydrogens summed into heavy atoms:
elementType: F F F O O O O N N N C C C C C C C C C C
charge: -0.152201 -0.172629 -0.182048 -0.255386 -0.086543 -0.084927 -0.250560 -0.209980 -0.044717 0.077049 0.087221 0.282165 -0.020195 0.243066 0.050416 0.182257 0.053346 0.096420 0.142881 0.244364
polarizability: 1.97856483e+02 8.87733009e+00 1.50126814e+02 -5.68515773e+00 1.85409718e+00 9.02803292e+01
1716.lowfreq: -15.0469 -0.0004 -0.0003 0.0005 1.4088 7.1170 26.6266 28.5294 45.7535
frequency: 25.9723 28.2848 45.6264 60.0942 89.4197 106.5569 109.4764 149.5915 161.1550 193.7579 205.3563 208.1473 261.4376 277.8351 284.1330 303.2023 311.4143 328.1876 333.2408 360.2388 389.6920 399.5756 436.0095 460.0584 480.3896 495.8354 507.1333 518.2628 549.9165 578.2901 613.8663 616.6546 650.8801 700.2159 721.3869 735.7660 740.0722 753.8561 793.0117 803.8697 858.6849 916.6761 932.2803 939.7695 947.1449 968.3250 986.3452 1007.3307 1010.1753 1018.3500 1039.5248 1045.5882 1051.0215 1068.8415 1088.1010 1157.0985 1173.9585 1197.8225 1211.5591 1221.2184 1244.7343 1254.4498 1269.2172 1286.6334 1298.7069 1320.8162 1332.5827 1338.3432 1379.2713 1398.4615 1410.3782 1454.3730 1470.4048 1474.3838 1494.4833 1599.8667 1638.3153 1648.1781 2935.1714 2971.0633 2994.6577 3038.6709 3073.4529 3098.9997 3101.8965 3111.2079 3530.7334 3568.9662 3578.2569 3682.7708
redmass: 7.6453 8.6650 5.3183 6.3929 6.0924 5.5709 7.2095 3.6815 7.2421 5.4355 6.1609 5.4910 5.8322 2.1503 1.9347 1.3522 3.4787 5.8558 5.9725 5.8039 7.5263 5.4170 3.8694 2.8974 3.5661 1.9388 3.1668 3.1126 4.7773 11.6608 3.0232 1.7212 6.8295 5.6411 8.8146 6.6493 5.1455 9.9497 3.9166 3.7494 3.1016 3.2164 7.1107 3.2403 4.1843 5.5463 2.0112 2.1792 2.5832 2.9228 4.9933 2.7562 2.6586 2.4718 3.0027 1.1989 1.3251 1.1857 3.9083 1.2425 1.2945 1.4011 2.0651 1.4351 1.9042 1.5092 1.4021 1.3167 1.5337 2.8996 1.4835 1.1081 1.0850 5.8751 4.2653 2.7422 1.8700 7.4612 1.0574 1.0856 1.1030 1.0650 1.0882 1.0888 1.0973 1.1011 1.0452 1.0663 1.0668 1.1052
irintensity: 1.2860 0.8963 2.4644 6.3759 9.5577 4.2570 6.6656 5.9665 5.9568 2.3657 3.3508 18.1377 3.1199 74.5159 70.1145 167.3158 18.6457 40.6106 4.8385 5.3960 1.8468 1.0239 6.8381 2.6205 15.1150 21.9161 23.3622 62.4705 18.0269 31.6869 36.2232 110.9647 8.1775 21.5016 0.6281 5.4170 1.6509 17.4674 18.1999 28.1898 14.5372 18.2962 274.2440 92.4944 170.4877 56.6460 29.1063 101.2892 57.4253 94.1967 74.4066 87.0538 56.4406 19.3983 67.6904 31.0608 3.7235 21.0826 13.5057 4.2368 9.4094 37.6219 290.1121 7.7407 80.0655 37.5811 53.0644 35.5555 3.0608 42.0617 1.4212 12.6708 6.5672 150.2492 213.9689 81.9761 187.5557 922.8003 39.1342 51.4650 66.1000 12.5117 6.2756 7.1868 82.7631 11.5165 130.2364 9.2311 11.2698 62.3341
temp: 298.150 k
press: 1.00000 atm
elementType: 9 9 9 8 8 8 8 7 7 7 6 6 6 6 6 6 6 6 6 6 1 1 1 1 1 1 1 1 1 1 1 1
symmnumber: 1
zpe: 601883.9 jmol-1
zpe.correction: 0.229245 hartree
zpe.thermalcorrener: 0.248274 hartree
zpe.thermalcorrenthalpy: 0.249218 hartree
zpe.thermalcorrgfe: 0.180971 hartree
zpe.sumelectzpe: -1151.419848 hartree
zpe.sumelectthermal: -1151.400819 hartree
zpe.sumelectthermalent: -1151.399875 hartree
zpe.sumelectthermalfe: -1151.468122 hartree
dipole: 1.2071 -2.0309 4.0340
dipole: 4.6748
quadrupole: -99.3242 -127.8286 -116.0575
quadrupole: -5.5733 10.1614 -7.3891
quadrupole: 15.0793 -13.4252 -1.6541 -5.5733 10.1614 -7.3891
hfenergy: -1151.6490935 hartree
pointgroup: C01 [X(C10H12F3N3O4)]
dipole: 0.5220026 0.9302075 -1.4983263 debye
polarizability: 195.4870583|-14.2547117|151.4139585|1.4891025|9.0990603|91.3626099 unknown
InChI: InChI=1S/C10H12F3N3O4/c11-10(12,13)4-2-16(9(19)15-8(4)14)7-1-5(18)6(3-17)20-7/h2,5-7,17-18H,1,3,14H2
charge 0 multiplicity 1
32 atoms
F  -1.863511 2.588983 0.883573
F  -3.085201 2.038605 -0.949416
F  -3.80452 1.410932 1.096498
O  2.150505 0.266198 1.095934
O  4.838763 -0.561262 0.009192
O  1.457558 2.846399 0.271898
O  0.34637 -3.142389 -0.430613
N  0.232195 -0.895859 0.209814
N  -1.770819 -2.109069 -0.429706
N  -3.833661 -1.061757 -0.4332
C  3.663682 -0.077189 -0.723737
C  1.718713 -0.97024 0.470825
C  2.53989 -1.139262 -0.838194
C  3.029383 1.015515 0.157452
C  2.24594 2.047019 -0.671528
C  -0.478564 0.246562 0.416944
C  -0.402517 -2.141803 -0.246021
C  -1.852164 0.270485 0.187883
C  -2.482071 -0.97876 -0.228028
C  -2.605744 1.537816 0.311389
H  3.961745 0.307221 -1.721956
H  1.870186 -1.800887 1.178029
H  1.902306 -0.941175 -1.717287
H  2.921614 -2.167119 -0.934472
H  3.777233 1.515275 0.792068
H  1.585095 1.542504 -1.410249
H  2.976552 2.675079 -1.223646
H  0.084486 1.124655 0.761921
H  5.172875 -1.390654 -0.416539
H  1.004364 3.586635 -0.203892
H  -4.467043 -0.296491 -0.211701
H  -4.202439 -1.967969 -0.719034
