program: Gaussian 09
title: 000125600
version: EM64L-G09RevD.01
frameworkgroup: C1[X(C13H21N3O2)]
method: RPBEPBE
basis: SDD
operation: Freq
keyword: #p
keyword: freq=noraman
keyword: PBEPBE/SDD
title: #p freq=noraman PBEPBE/SDD
converged: YES YES NO NO
title: Mulliken charges:
elementType: O O N N N C C C C C C C C C C C C C H H H H H H H H H H H H H H H H H H H H H
charge: -0.293620 -0.410886 -0.106699 -0.375637 -0.368683 -0.343812 -0.338835 -0.326178 -0.402794 -0.671268 -0.673417 0.157606 0.273070 -0.347380 -0.336325 0.429062 -0.413477 -0.384207 0.235894 0.192439 0.236157 0.189310 0.187671 0.205768 0.231982 0.246382 0.225471 0.203582 0.207397 0.205784 0.227924 0.204495 0.294621 0.274631 0.211184 0.228017 0.256345 0.298432 0.369993
chargesum: 0.00000
title: Mulliken charges with hydrogens summed into heavy atoms:
elementType: O O N N N C C C C C C C C C C C C C
charge: -0.293620 -0.040893 -0.106699 -0.081016 -0.070251 0.084521 0.086632 0.067261 0.075569 -0.034818 -0.035213 0.157606 0.273070 -0.072749 -0.125141 0.429062 -0.185460 -0.127862
polarizability: 2.69973548e+02 9.50379299e+00 1.62962592e+02 1.36485942e+01 -1.48447299e+01 1.16232131e+02
1716.lowfreq: -15.6988 -0.0001 0.0004 0.0007 2.8185 4.0918 16.9283 18.6469 28.0691
frequency: 15.9213 18.6034 28.0673 56.7097 61.5098 76.8985 81.8909 83.4390 110.8377 124.4488 173.4749 203.7085 225.8681 240.4268 245.2083 278.1633 291.4406 301.8941 313.6127 353.6623 388.2776 398.7819 408.6730 442.3971 468.0567 474.4508 488.1399 525.1999 542.5479 585.5040 630.8624 668.5743 682.3946 735.7239 749.9026 754.8593 794.1652 798.0458 821.5567 827.3013 836.5921 855.0859 916.6931 951.5502 968.3747 981.7331 989.0134 991.2195 1011.3960 1040.8003 1066.2038 1073.7338 1077.3376 1084.3988 1118.9753 1125.0972 1143.9659 1175.0382 1183.3451 1207.0862 1248.4756 1250.6699 1275.2723 1281.4570 1290.1990 1302.6922 1303.0671 1320.7422 1329.6763 1354.1187 1363.1895 1372.5278 1378.4601 1384.8674 1387.0567 1422.1942 1436.2982 1444.3290 1461.5384 1463.0670 1471.7312 1476.8275 1480.3196 1482.5389 1488.3757 1491.7884 1510.7129 1563.6863 1598.2190 1623.9995 2851.7128 2865.5980 2909.2050 2980.4472 2981.2301 3022.6540 3028.2172 3031.9277 3033.4834 3072.0185 3073.9843 3089.4481 3090.0948 3093.2988 3120.5255 3124.7631 3162.1642 3178.1726 3453.3856 3517.6116 3566.3076
redmass: 3.7061 4.4925 4.4946 4.6032 3.1761 2.5308 2.6267 3.5473 4.3439 3.5704 1.4574 1.5523 3.0363 2.7941 2.3941 2.0634 2.9853 2.3448 3.5502 1.3918 3.9298 2.8443 2.8936 3.0610 4.1619 3.1583 2.3187 1.3311 3.5250 2.9681 6.5048 2.7033 4.2110 1.7887 3.7460 2.2718 1.1449 1.2433 1.9946 1.4246 1.9761 2.7817 1.9642 1.4036 3.7616 1.3654 2.2964 4.0216 2.8646 3.3266 1.9191 2.6471 1.9075 2.1812 1.3870 1.6710 2.5147 1.9050 1.1784 2.2704 1.5313 1.8095 2.0427 1.2111 1.2264 1.2806 1.1602 1.5580 1.3488 2.7743 1.3218 1.3013 1.3230 1.2466 1.2485 4.0654 1.1842 1.3949 1.0552 1.0558 1.1320 1.6509 1.0567 1.0743 1.0817 1.0990 2.6684 5.9245 6.3620 6.3819 1.0721 1.0715 1.0687 1.0356 1.0356 1.0620 1.0865 1.0887 1.0897 1.0984 1.0980 1.1003 1.1002 1.1044 1.0893 1.0891 1.0949 1.0936 1.0770 1.0685 1.0773
irintensity: 0.3792 0.6176 0.4497 7.4306 0.6986 0.3612 1.3320 0.8020 2.5072 1.3757 2.8769 0.7991 2.2637 0.1650 1.5539 2.8681 18.4003 3.7910 13.5646 61.4633 3.3765 5.3872 4.2969 4.3003 9.1099 14.1000 49.3241 122.6052 13.3926 224.5433 4.3780 145.2111 22.2138 9.7254 28.2427 1.2247 4.2293 11.0311 19.6146 23.6884 27.6676 49.5122 0.1751 2.2729 43.7916 1.1282 3.2477 3.4854 2.9757 5.1900 26.8772 20.3953 35.1492 2.9094 5.5120 21.1413 5.6814 27.5155 57.4055 42.4048 17.1851 15.7504 208.7477 2.6985 17.2246 18.0189 17.5131 95.0751 19.2328 5.4206 5.6712 4.3652 1.0732 25.4991 22.8153 3.7374 20.0332 16.4381 10.5342 2.6555 67.9423 260.0537 8.0537 16.5425 8.9724 10.2501 47.9456 88.3024 84.7665 144.4991 62.0230 130.4609 71.2596 37.1509 31.6087 37.4912 13.9381 24.2729 15.8747 41.1935 82.8999 38.0858 49.0812 14.7251 23.2402 8.7534 4.9661 4.0076 10.4117 31.4701 10.9172
temp: 298.150 k
press: 1.00000 atm
elementType: 8 8 7 7 7 6 6 6 6 6 6 6 6 6 6 6 6 6 1 1 1 1 1 1 1 1 1 1 1 1 1 1 1 1 1 1 1 1 1
symmnumber: 1
zpe: 859954.6 jmol-1
zpe.correction: 0.327539 hartree
zpe.thermalcorrener: 0.347536 hartree
zpe.thermalcorrenthalpy: 0.348480 hartree
zpe.thermalcorrgfe: 0.275899 hartree
zpe.sumelectzpe: -821.235081 hartree
zpe.sumelectthermal: -821.215085 hartree
zpe.sumelectthermalent: -821.214141 hartree
zpe.sumelectthermalfe: -821.286721 hartree
dipole: 2.4292 3.3245 1.5613
dipole: 4.4035
quadrupole: -83.9034 -104.1496 -111.8643
quadrupole: 0.9848 5.8066 -3.5085
quadrupole: 16.0690 -4.1772 -11.8919 0.9848 5.8066 -3.5085
hfenergy: -821.5626202 hartree
pointgroup: C01 [X(C13H21N3O2)]
dipole: -0.9883004 -1.3635977 0.406653 debye
polarizability: 270.5418117|8.8250649|157.0774768|-10.8284608|21.3979003|121.5489823 unknown
InChI: InChI=1S/C13H21N3O2/c1-3-16(4-2)10-9-14-13(17)11-5-7-12(15-18)8-6-11/h5-8,14-15,18H,3-4,9-10H2,1-2H3
charge 0 multiplicity 1
39 atoms
O  0.353502 1.688313 0.068269
O  -6.610018 -0.862405 -0.44647
N  4.244971 -0.334964 0.134755
N  0.551167 -0.470871 -0.762899
N  -5.863308 -0.097282 0.561987
C  2.817261 -0.68902 0.317228
C  4.512035 1.101665 0.430312
C  5.187028 -1.25846 0.81823
C  2.004384 -0.345625 -0.958848
C  5.705067 1.664672 -0.365104
C  5.324069 -2.614553 0.099609
C  -0.196654 0.582995 -0.25468
C  -1.674118 0.357968 -0.1018
C  -2.392426 1.254663 0.73356
C  -2.396726 -0.66901 -0.764178
C  -4.483335 0.06703 0.275033
C  -3.775365 1.117858 0.926104
C  -3.785217 -0.820919 -0.583119
H  2.357153 -0.155933 1.181775
H  2.733357 -1.772752 0.521346
H  3.60336 1.675686 0.171329
H  4.676659 1.261329 1.525747
H  4.898346 -1.423909 1.887794
H  6.178606 -0.770248 0.835848
H  2.324983 -0.999254 -1.789226
H  2.209213 0.699585 -1.245283
H  5.517983 1.568245 -1.448837
H  6.644892 1.129988 -0.134259
H  5.859268 2.733414 -0.124951
H  6.050968 -3.261436 0.62596
H  5.670831 -2.459533 -0.936959
H  4.362132 -3.158098 0.059063
H  0.113052 -1.382212 -0.895266
H  -1.833535 2.064196 1.214137
H  -1.894595 -1.341922 -1.470373
H  -4.309803 1.815278 1.582737
H  -4.341674 -1.590312 -1.123894
H  -6.382236 0.77395 0.736348
H  -6.893477 -1.678018 0.046576
