program: Gaussian 09
title: 000125587
version: EM64L-G09RevD.01
frameworkgroup: C1[X(C12H15NO4)]
method: RPBEPBE
basis: SDD
operation: Freq
keyword: #p
keyword: freq=noraman
keyword: PBEPBE/SDD
title: #p freq=noraman PBEPBE/SDD
converged: YES YES NO NO
title: Mulliken charges:
elementType: O O O O N C C C C C C C C C C C C H H H H H H H H H H H H H H H
charge: -0.212032 -0.196898 -0.433835 -0.442930 -0.282952 -0.050160 0.357790 -0.157400 0.372765 0.324886 0.140525 -0.825198 -0.670017 -0.402997 -0.387306 -0.503868 -0.474672 0.255971 0.288206 0.227876 0.259120 0.257787 0.215678 0.230736 0.253459 0.253241 0.239238 0.231110 0.234621 0.221026 0.338477 0.337752
chargesum: 0.00000
title: Mulliken charges with hydrogens summed into heavy atoms:
elementType: O O O O N C C C C C C C C C C C C
charge: -0.212032 -0.196898 -0.095358 -0.105178 -0.282952 -0.050160 0.357790 0.098571 0.372765 0.324886 0.140525 -0.049996 0.034184 -0.149538 -0.134065 -0.033520 -0.019024
polarizability: 1.73908565e+02 -8.84107426e+00 1.46136717e+02 1.24907660e+01 -6.76923319e+00 1.22651854e+02
1716.lowfreq: -13.9042 -7.3854 -0.0007 -0.0003 0.0003 7.5592 31.9795 52.9581 56.0934
frequency: 31.5693 52.8927 56.0615 75.4684 89.6432 100.2529 125.7219 136.1129 150.9882 176.2529 199.2524 213.5975 227.7249 248.0885 271.9701 304.4871 323.3061 342.8017 362.0968 393.7856 441.2938 447.8586 507.9396 540.0323 568.7387 577.7839 621.0457 634.0646 671.5506 713.3166 725.0114 768.0355 787.1147 820.0119 858.2423 879.7763 884.7364 893.7081 913.7677 941.6104 949.2865 995.8219 1008.6953 1024.8048 1035.0655 1050.2642 1066.5920 1103.2322 1107.0566 1138.5858 1146.0020 1224.0459 1230.3573 1261.2105 1285.8756 1296.5427 1305.4887 1311.1030 1335.2612 1343.9793 1362.5736 1371.1462 1390.9473 1399.9499 1423.4709 1451.1668 1460.3253 1461.6651 1466.5106 1467.6991 1477.0438 1515.9209 1564.4644 1667.8589 1700.7537 2979.5024 2983.1267 2997.9219 3000.7774 3004.7073 3065.9530 3079.3497 3097.0554 3099.8988 3105.1305 3111.6464 3203.1646 3225.3979 3546.7117 3552.6449
redmass: 6.0568 4.4818 4.2826 3.8611 4.6315 3.2442 4.4885 3.0251 1.4541 3.3521 2.4735 1.3065 2.2901 2.0141 2.0842 1.8964 1.9622 3.1820 2.6377 2.5368 4.7087 4.5814 4.2200 4.5560 4.2276 5.3819 5.3877 3.8914 4.6672 3.7538 6.1320 4.6194 1.4693 2.9251 1.5257 4.0124 4.1065 3.5567 5.0715 2.0486 1.8753 1.4450 2.5048 1.8378 1.8461 1.7465 2.1939 3.2129 2.3142 1.1846 1.1646 1.4276 1.9376 2.0725 1.6404 1.3364 1.8166 1.7164 4.9349 2.8050 1.2026 1.3674 1.2268 1.2400 4.0695 1.1129 1.1015 1.0611 1.0866 1.0614 1.0579 7.9482 6.2208 9.4908 12.7298 1.0692 1.0376 1.0356 1.0641 1.0839 1.0956 1.1001 1.1003 1.0997 1.0947 1.1004 1.0932 1.1035 1.0662 1.0663
irintensity: 3.8059 1.2374 1.5371 5.1776 1.6631 3.0451 0.7112 1.6296 0.4623 1.4031 14.4364 9.5777 6.9842 4.8564 88.2328 8.1749 104.8082 40.4923 24.3158 24.0340 34.7315 3.5509 1.8450 9.0330 2.4089 9.0692 6.4627 2.6776 4.3086 26.4544 15.7113 7.2293 63.8897 4.4280 7.4897 8.6374 69.5831 43.3996 158.4097 23.1136 8.3754 13.9315 8.6182 1.4808 11.9268 22.7704 3.5773 31.7979 26.6254 26.0129 35.1978 24.3822 15.4206 23.6675 11.2361 7.7124 3.0951 6.1120 14.6313 6.0073 26.3523 27.1221 13.9065 31.4293 113.4832 2.2393 7.2288 12.4193 17.3455 14.9980 11.4898 8.2168 6.2430 87.9108 277.9333 35.2223 8.0871 15.1150 50.0788 9.4241 6.3857 16.2262 15.6628 18.4771 14.7456 14.4491 4.8721 2.5993 3.7328 1.2924
temp: 298.150 k
press: 1.00000 atm
elementType: 8 8 8 8 7 6 6 6 6 6 6 6 6 6 6 6 6 1 1 1 1 1 1 1 1 1 1 1 1 1 1 1
symmnumber: 1
zpe: 661125.0 jmol-1
zpe.correction: 0.251809 hartree
zpe.thermalcorrener: 0.269467 hartree
zpe.thermalcorrenthalpy: 0.270411 hartree
zpe.thermalcorrgfe: 0.205949 hartree
zpe.sumelectzpe: -820.615127 hartree
zpe.sumelectthermal: -820.597469 hartree
zpe.sumelectthermalent: -820.596525 hartree
zpe.sumelectthermalfe: -820.660987 hartree
dipole: -0.6404 2.9702 -3.7333
dipole: 4.8136
quadrupole: -85.2816 -105.3355 -112.8751
quadrupole: -0.5932 8.3092 -3.0262
quadrupole: 15.8825 -4.1715 -11.7110 -0.5932 8.3092 -3.0262
hfenergy: -820.8669358 hartree
pointgroup: C01 [X(C12H15N1O4)]
dipole: -0.2263894 -0.677897 1.7537584 debye
polarizability: 173.0603926|2.0525473|139.9547259|-17.1849006|-11.1781276|129.6820181 unknown
InChI: InChI=1S/C12H15NO4/c1-7-8(2)17-12(16)11(7)13-9(5-14)3-4-10(13)6-15/h3-4,8,14-15H,5-6H2,1-2H3
charge 0 multiplicity 1
32 atoms
O  -2.647996 -0.235858 -1.128685
O  -0.90415 0.207474 -2.633222
O  0.206868 3.082778 0.802216
O  1.017646 -2.787499 1.413267
N  0.911859 0.10003 -0.173416
C  -0.50275 -0.049852 -0.19379
C  -1.32791 -0.289985 0.870458
C  -2.750598 -0.439548 0.350922
C  1.599878 1.324627 -0.310382
C  1.846444 -0.958731 -0.089138
C  -1.282382 -0.000149 -1.469362
C  -0.962876 -0.428558 2.31452
C  -3.769769 0.561279 0.915805
C  2.969835 1.036292 -0.293642
C  3.124166 -0.384626 -0.162632
C  0.879342 2.632365 -0.44697
C  1.449993 -2.394307 0.037571
H  -3.106802 -1.478295 0.496745
H  -0.88578 -1.501394 2.574624
H  -1.719438 0.035001 2.972479
H  0.0225 0.022509 2.517265
H  -4.734315 0.439156 0.396724
H  -3.930236 0.385007 1.994355
H  -3.425381 1.599656 0.768952
H  3.763428 1.777493 -0.373847
H  4.060852 -0.941056 -0.140111
H  1.613315 3.42436 -0.658234
H  0.146743 2.604895 -1.279715
H  0.575295 -2.647303 -0.584211
H  2.301117 -3.025943 -0.282078
H  -0.571626 2.491322 0.966548
H  1.755926 -2.558642 2.035082
