program: Gaussian 09
title: 000012170
version: EM64L-G09RevD.01
frameworkgroup: C1[X(C7H8O3)]
method: RPBEPBE
basis: SDD
operation: Freq
keyword: #p
keyword: freq=noraman
keyword: PBEPBE/SDD
title: #p freq=noraman PBEPBE/SDD
converged: YES YES NO NO
title: Mulliken charges:
elementType: O O O C C C C C C C H H H H H H H H
charge: -0.227588 -0.256848 -0.248325 0.390381 -0.424473 -0.392727 -0.252041 -0.163967 0.296309 -0.743449 0.237529 0.264720 0.260940 0.254765 0.260630 0.247421 0.251932 0.244791
chargesum: 0.00000
title: Mulliken charges with hydrogens summed into heavy atoms:
elementType: O O O C C C C C C C
charge: -0.227588 -0.256848 -0.248325 0.390381 0.077776 -0.131787 0.002724 0.096662 0.296309 0.000695
polarizability: 1.11966055e+02 2.92119955e+00 7.63299065e+01 7.62488587e+00 1.71866119e+00 6.00533570e+01
1716.lowfreq: -2.4150 -0.0006 0.0006 0.0009 5.0044 11.9797 24.5551 29.6322 47.7050
frequency: 24.4602 29.6294 47.6691 77.5023 179.6145 232.8544 309.1342 319.1871 444.4273 560.7634 589.9522 593.9329 642.0636 719.0758 737.0480 789.8646 827.3119 870.7147 877.8325 881.9533 896.7571 974.4675 991.0200 1022.6203 1042.6919 1050.5733 1136.4691 1178.3126 1195.5997 1229.8331 1259.8650 1339.9874 1367.8785 1382.5210 1452.8731 1454.6289 1458.3857 1483.2180 1593.7520 1657.0223 3009.7758 3029.1451 3098.9140 3106.0369 3144.5579 3219.2479 3234.4011 3268.5992
redmass: 1.2964 4.3737 3.6717 3.4030 5.3019 5.4670 3.9056 2.3667 3.5812 3.1470 5.0309 3.0766 4.5174 4.7416 1.2730 3.4265 1.4507 6.0578 2.3936 1.9010 5.0738 2.0607 1.9268 1.4508 1.6602 3.2633 1.5854 1.8955 2.7399 1.8261 1.4863 1.3479 2.4864 1.2508 1.0629 1.0471 1.1266 4.6506 6.9504 9.0618 1.0365 1.0587 1.0975 1.1057 1.1012 1.0929 1.0985 1.1084
irintensity: 0.8428 1.0519 0.4080 2.3992 5.7264 7.6901 4.7121 6.4263 10.5126 2.3642 5.2445 7.1123 1.8503 18.3541 86.2116 26.0432 27.4058 12.2353 8.1221 20.5353 120.3857 59.6634 54.6295 21.2950 8.0813 2.3702 15.0985 99.7290 247.9353 8.7322 12.2208 9.5945 0.3886 55.2102 29.2842 21.4703 14.2012 10.5913 1.4924 211.7940 2.5153 25.6312 7.3757 8.1257 11.2750 3.7398 0.2974 0.3333
temp: 298.150 k
press: 1.00000 atm
elementType: 8 8 8 6 6 6 6 6 6 6 1 1 1 1 1 1 1 1
symmnumber: 1
zpe: 359083.9 jmol-1
zpe.correction: 0.136768 hartree
zpe.thermalcorrener: 0.146717 hartree
zpe.thermalcorrenthalpy: 0.147661 hartree
zpe.thermalcorrgfe: 0.098551 hartree
zpe.sumelectzpe: -496.442170 hartree
zpe.sumelectthermal: -496.432221 hartree
zpe.sumelectthermalent: -496.431277 hartree
zpe.sumelectthermalfe: -496.480387 hartree
dipole: 1.6875 1.5034 1.6677
dipole: 2.8088
quadrupole: -50.6739 -54.5436 -60.4898
quadrupole: -2.8676 -4.5222 -4.1900
quadrupole: 4.5619 0.6921 -5.2540 -2.8676 -4.5222 -4.1900
hfenergy: -496.5789374 hartree
pointgroup: C01 [X(C7H8O3)]
dipole: -0.6497241 -0.0424255 0.8928666 debye
dipolederiv: -0.4184144 -0.0351619 0.2105548 -0.0117839 -0.2921484 0.1615452 0.1898066 0.1828759 -0.3792255 -1.612609 -0.322035 0.2649794 -0.6427686 -0.5184415 0.0644151 0.2038555 0.0550463 -0.5288267 -0.690147 -0.1344088 0.0696508 -0.0791473 -0.414002 -0.1983913 0.4643909 -0.0581968 -0.9050593 -0.0069287 0.0228995 -0.1111997 0.0738516 0.059366 -0.1947513 0.0056787 -0.2410761 0.1828511 1.0143944 0.0554486 -0.0090332 0.2362703 0.4021099 0.0095765 0.4051149 0.083637 0.1796828 -0.0522881 -0.0918356 0.0379463 -0.0983992 -0.0702 -0.08813 -0.0330646 -0.0817725 -0.1010172 -0.0323107 -0.058767 -0.0477234 -0.0081652 -0.1474027 -0.0233555 -0.0811657 -0.0321221 -0.170168 0.1051022 0.002743 -0.1891727 0.052225 -0.0066374 -0.1349225 -0.1708354 -0.1237823 0.0912938 1.5018288 0.5549247 -0.2800807 0.625103 0.5899646 0.2042736 -0.8490243 0.0656556 1.2037243 -0.1566141 -0.122606 -0.092823 -0.2064306 -0.1258327 -0.1388899 -0.1274446 -0.1786169 -0.1566704 -0.0093467 -0.0373268 -0.0013187 -0.0459381 -0.0677147 0.0513781 -0.0596422 0.1011894 0.0720573 0.0537948 0.0365562 0.0347932 -0.0373809 0.1054642 0.0171966 -0.0942292 -0.069652 0.0021305 0.1440327 0.0347902 0.0004849 0.0311207 0.0733768 0.1081945 0.0038171 0.1079878 0.0824434 -0.0217685 0.0380091 0.0667878 0.0418619 0.1583336 0.0281912 0.0754311 0.023435 0.144674 0.0895189 0.0458261 0.0155293 0.0607477 0.1030256 0.0889143 0.0034953 0.0976497 0.1221214 0.0956281 -0.0112056 -0.0510116 0.0357306 0.0549343 0.0963601 -0.054922 0.0754466 0.0003178 0.0329151 0.0937136 0.0254063 0.0512304 0.0034497 -0.0572706 0.0272395 -0.0384097 0.1166815 -0.0367876 -0.0715643 0.0562303 -0.0781275 0.0923547 0.0056659 0.0914986 0.0307047 0.0429896 unknown
polarizability: 111.9457971|-0.1544043|67.1189192|-7.6846041|-8.7461152|69.2846019 unknown
InChI: InChI=1S/C7H8O3/c1-6(8)10-5-7-3-2-4-9-7/h2-4H,5H2,1H3
charge 0 multiplicity 1
18 atoms
O  -1.330814 0.518665 -0.907516
O  1.36041 -0.207124 0.585314
O  2.645288 -0.057282 -1.367542
C  -0.996246 -0.528296 -0.015978
C  0.369767 -1.094967 -0.126163
C  -2.087998 -0.800043 0.795966
C  -3.150768 0.103629 0.41006
C  -2.65394 0.886526 -0.618669
C  2.44813 0.257952 -0.173712
C  3.309008 1.171787 0.671295
H  0.42047 -2.06898 0.385624
H  0.701719 -1.193087 -1.175037
H  -2.125327 -1.552862 1.58127
H  -4.148578 0.162383 0.839755
H  -3.061681 1.690849 -1.224423
H  3.660779 0.638848 1.571226
H  2.715123 2.037087 1.01273
H  4.16936 1.519116 0.081702
