program: Gaussian 09
title: 000125595
version: EM64L-G09RevD.01
frameworkgroup: C1[X(C15H13ClN2O2S)]
method: RPBEPBE
basis: SDD
operation: Freq
keyword: #p
keyword: freq=noraman
keyword: PBEPBE/SDD
title: #p freq=noraman PBEPBE/SDD
converged: YES YES NO NO
title: Mulliken charges:
elementType: Cl S O O N N C C C C C C C C C C C C C C C H H H H H H H H H H H H H
charge: -0.042782 0.289650 -0.180699 -0.170314 -0.220787 -0.571960 -0.491674 0.611686 0.575039 -0.358685 -0.292754 -0.383371 -0.384590 -0.461569 -0.233105 -0.362287 -0.249516 0.010349 -0.166631 0.065784 -0.264337 0.260096 0.251727 0.261768 0.215260 0.182239 0.216273 0.271602 0.275316 0.269764 0.254074 0.269098 0.267087 0.288249
chargesum: 0.00000
title: Mulliken charges with hydrogens summed into heavy atoms:
elementType: Cl S O O N N C C C C C C C C C C C C C C C
charge: -0.042782 0.289650 -0.180699 -0.170314 -0.220787 -0.016624 0.020149 0.611686 0.575039 0.118343 -0.292754 -0.383371 0.013922 -0.189967 0.042211 -0.092523 0.004557 0.010349 -0.166631 0.065784 0.004761
polarizability: 4.13284081e+02 -2.19736661e+01 2.40963223e+02 3.80510672e+00 5.68222029e+00 9.72388323e+01
1716.lowfreq: -1.7186 0.0011 0.0018 0.0024 7.6943 9.1739 25.2471 28.5893 38.4950
frequency: 25.1593 28.5796 38.3220 65.2726 80.3872 85.5403 127.4179 134.6585 146.2746 169.4178 188.4934 210.4404 220.0502 260.3667 270.0905 288.9047 331.4512 334.3725 344.6179 362.6937 405.1561 416.7331 438.4657 450.0597 467.8290 482.9315 503.6995 545.7868 549.2679 572.9663 582.0757 627.9673 661.5419 670.5999 681.4493 703.2069 714.9224 757.8117 766.6135 784.1288 802.5372 842.4451 846.5788 852.4594 879.9511 899.9979 938.7839 970.4495 999.8992 1003.0481 1037.7921 1071.6001 1079.3193 1104.5208 1115.5042 1141.1756 1163.0686 1169.7504 1216.1243 1233.0272 1247.9093 1277.4700 1280.7780 1293.4848 1298.3525 1307.9386 1342.1945 1361.1584 1369.6012 1391.6732 1395.0663 1410.9787 1466.3002 1483.1974 1494.0848 1517.6924 1532.9305 1537.2614 1561.4884 1565.5314 1572.7909 1602.7929 1643.8990 2855.7420 2996.7907 3017.0793 3023.1342 3061.6146 3082.5678 3145.7595 3147.8765 3187.4521 3191.0747 3207.6556 3482.8575 3612.4254
redmass: 6.7853 5.3384 7.7787 5.1288 2.0537 9.5647 8.0504 9.1637 4.5182 2.6631 4.0002 1.5320 3.7155 5.8412 6.8992 8.1998 7.5805 10.3746 10.7095 12.4684 3.4150 3.9015 4.7011 3.6192 4.5518 3.8605 5.1723 1.7319 3.4904 6.1908 5.6747 7.8765 6.9610 8.0403 5.6621 4.7374 4.3861 1.8445 1.4919 2.3913 1.3364 1.6740 1.5210 1.4730 2.2156 2.5991 1.3474 1.9390 3.6769 5.0042 4.8147 5.3637 2.2312 2.0539 2.9570 1.4962 1.6774 3.4004 2.5370 1.5445 1.4020 1.3179 1.5609 1.8276 1.3713 1.2941 2.0139 2.0505 2.0431 2.5334 1.9807 3.8203 2.5387 1.0821 1.1013 1.2750 4.4443 6.4964 10.9847 7.1917 7.6735 7.4932 1.0949 1.0718 1.0679 1.0793 1.0658 1.0987 1.1024 1.0922 1.0905 1.0962 1.0901 1.0910 1.0451 1.0988
irintensity: 2.1679 0.5342 0.5217 0.5083 2.1391 0.6852 1.1564 3.4791 2.6559 9.9883 3.2169 36.6957 6.2449 2.2367 0.7012 0.4204 0.1600 5.9662 0.2385 0.9293 2.9336 25.1109 5.1663 7.4211 5.6810 9.5979 7.2701 135.2520 85.4135 2.2718 3.1226 6.8393 3.5062 1.3336 6.6898 1.7316 3.0013 1.7395 3.7848 5.4277 41.1712 23.8155 68.3411 32.3388 2.6652 64.9844 0.0201 0.3182 3.4519 14.0986 13.1913 10.7950 13.3609 39.8403 31.4834 14.6916 9.0773 6.4956 25.3185 17.9756 7.7577 13.1590 0.8441 124.7683 49.9620 8.3698 1.2914 56.1408 34.1212 12.3735 21.9970 75.7925 74.1356 4.2381 8.6179 41.0707 574.5111 305.5208 53.1807 8.8320 32.1266 32.4422 42.4212 110.0538 4.6027 15.6651 43.4519 0.6185 21.4524 0.2721 2.2077 0.3275 2.9788 0.3682 1.4663 2.7730
temp: 298.150 k
press: 1.00000 atm
elementType: 17 16 8 8 7 7 6 6 6 6 6 6 6 6 6 6 6 6 6 6 6 1 1 1 1 1 1 1 1 1 1 1 1 1
symmnumber: 1
zpe: 656931.4 jmol-1
zpe.correction: 0.250212 hartree
zpe.thermalcorrener: 0.269632 hartree
zpe.thermalcorrenthalpy: 0.270576 hartree
zpe.thermalcorrgfe: 0.200615 hartree
zpe.sumelectzpe: -1695.925778 hartree
zpe.sumelectthermal: -1695.906358 hartree
zpe.sumelectthermalent: -1695.905414 hartree
zpe.sumelectthermalfe: -1695.975375 hartree
dipole: 9.2432 0.0859 1.5690
dipole: 9.3758
quadrupole: -190.3862 -114.6373 -138.9025
quadrupole: 7.6615 -5.0716 5.2441
quadrupole: -42.4108 33.3380 9.0728 7.6615 -5.0716 5.2441
hfenergy: -1696.1759901 hartree
pointgroup: C01 [X(C15H13Cl1N2O2S1)]
dipole: 3.6486437 -0.0082162 0.5422645 debye
polarizability: 412.7848362|-23.8140822|241.4778072|-2.6485966|6.2491185|97.2234932 unknown
InChI: InChI=1S/C15H13ClN2O2S/c16-9-2-3-14-10(6-9)18(5-1-4-17)11-7-12(19)13(20)8-15(11)21-14/h2-3,6-8H,1,4-5,17H2
charge 0 multiplicity 1
34 atoms
Cl 5.479075 -0.235918 -0.228629
S  -0.36318 -2.848652 0.203369
O  -4.298626 1.64948 0.109138
O  -5.114138 -1.067069 -0.30823
N  0.312508 0.248561 0.487195
N  1.293962 5.027865 -0.747711
C  0.638293 1.632844 0.941445
C  -1.051373 -0.052798 0.270233
C  1.404223 -0.622867 0.209766
C  0.821034 2.660303 -0.201757
C  -1.506589 -1.450961 0.067197
C  1.242344 -2.026817 0.030732
C  1.098135 4.075769 0.35483
C  -2.023522 0.945315 0.274519
C  2.730026 -0.102385 0.114705
C  -2.832102 -1.766902 -0.126011
C  2.349036 -2.866165 -0.224364
C  -3.450727 0.700778 0.095862
C  3.812095 -0.960233 -0.12423
C  -3.897569 -0.757635 -0.130214
C  3.655641 -2.347572 -0.299988
H  -0.172888 1.957618 1.615908
H  1.548267 1.578335 1.563973
H  -0.075705 2.707416 -0.843243
H  1.656873 2.354574 -0.86102
H  1.957361 4.023157 1.070757
H  0.220925 4.41101 0.94138
H  -1.766311 2.000511 0.376853
H  2.92469 0.965514 0.205704
H  -3.146991 -2.805737 -0.275404
H  2.186686 -3.940349 -0.361613
H  4.512481 -2.996669 -0.493269
H  2.135974 4.875164 -1.308703
H  1.146993 6.011416 -0.51178
