program: Gaussian 09
title: 000125614
version: EM64L-G09RevD.01
frameworkgroup: C1[X(C12H21N3O3S)]
method: RPBEPBE
basis: SDD
operation: Freq
keyword: #p
keyword: freq=noraman
keyword: PBEPBE/SDD
title: #p freq=noraman PBEPBE/SDD
converged: YES YES NO NO
title: Mulliken charges:
elementType: S O O O N N N C C C C C C C C C C C C H H H H H H H H H H H H H H H H H H H H H
charge: 0.196921 -0.283189 -0.289461 -0.450249 -0.458791 -0.408324 -0.395354 -0.091576 -0.077859 -0.470204 -0.693866 -0.379447 -0.413870 0.166078 -0.369299 -0.561809 0.292458 -0.356994 -0.317766 0.254504 0.246083 0.261521 0.257379 0.249061 0.240264 0.217544 0.395104 0.311327 0.247654 0.206264 0.212208 0.212773 0.245471 0.219989 0.312727 0.241769 0.227051 0.238380 0.227570 0.337959
chargesum: 0.00000
title: Mulliken charges with hydrogens summed into heavy atoms:
elementType: S O O O N N N C C C C C C C C C C C C
charge: 0.196921 -0.283189 -0.289461 -0.112291 -0.063687 -0.096997 -0.082626 0.162928 0.168223 -0.208682 -0.187426 0.078361 0.040048 0.166078 0.055682 -0.096349 0.292458 0.111827 0.148184
polarizability: 2.08118810e+02 -2.82142409e+00 1.74171819e+02 1.46714085e+00 -8.19222322e-01 1.31794527e+02
1716.lowfreq: -11.4731 -6.8232 -4.0354 -0.0018 0.0011 0.0015 12.7904 24.4900 32.0509
frequency: 11.6640 23.6670 31.8590 54.0781 67.8328 73.4737 83.3877 90.4401 107.3615 126.3895 157.1306 180.0561 214.9274 226.3753 247.3862 267.2328 269.4323 282.9149 325.1857 331.4503 361.0191 373.2826 424.8627 472.4423 487.3239 513.1728 534.6629 577.3777 583.1239 595.9947 634.8269 653.0408 655.9796 701.3062 705.7741 737.9415 770.9261 794.9939 814.3325 845.0932 854.6709 863.3883 874.0760 880.7961 916.5753 935.2444 970.7235 991.8663 1003.9005 1018.7010 1034.6214 1046.0589 1060.0138 1062.9252 1076.0262 1089.7073 1112.4733 1124.8119 1148.2311 1156.9985 1177.1569 1189.9855 1200.5797 1207.4171 1229.8580 1242.8381 1249.6382 1264.1980 1270.6738 1278.0030 1291.7848 1295.5521 1316.4681 1323.6265 1330.7491 1340.3870 1348.6273 1351.7596 1357.5468 1367.6112 1372.7478 1389.4393 1428.6198 1433.0115 1440.0848 1442.8182 1464.4800 1467.5630 1469.3851 1483.0795 1488.4066 1608.1544 1695.8060 2946.7116 2970.3850 2972.9994 2979.5384 2989.4239 2992.3976 2994.2886 3003.7704 3016.5549 3017.0346 3025.4824 3042.2635 3048.1067 3068.1025 3084.1100 3094.6981 3101.0911 3441.6761 3556.6429 3572.1541 3631.6737
redmass: 6.8938 5.0422 5.9438 5.4553 4.8703 6.4858 3.9251 9.1876 3.5359 2.7567 3.4356 2.9311 3.2818 2.8179 1.4555 2.7133 2.7294 3.2189 3.3851 3.2559 1.1377 3.2529 3.5709 2.8869 2.4033 3.8494 4.6878 3.5392 1.5122 2.1901 5.7309 3.7057 4.4519 2.8857 8.9340 1.6066 1.4388 1.7274 2.4193 3.3010 3.4271 1.8670 1.9597 2.4291 2.2688 2.7483 3.6988 2.5968 2.9302 2.1228 2.1928 2.6598 2.2414 1.5345 2.0861 1.8388 2.7762 2.6182 1.2893 1.5018 1.2718 1.2840 1.2369 1.6296 1.6130 1.4222 1.7880 1.4944 1.2383 1.2711 1.4931 1.2601 1.1893 1.2556 1.1837 1.4855 1.3573 1.3220 1.5953 1.4234 1.2168 2.2116 1.1689 1.3622 1.1009 1.0904 1.0864 1.0837 1.0878 1.1252 1.8605 5.8488 6.4465 1.0843 1.0602 1.0844 1.0667 1.0617 1.0630 1.0864 1.0639 1.0623 1.0592 1.0976 1.0922 1.1029 1.1026 1.1023 1.1049 1.1042 1.0838 1.0781 1.0663 1.0796
irintensity: 0.7926 0.2323 6.7191 3.2116 2.4791 3.4872 0.6537 3.5160 6.2375 3.2525 0.1895 2.6200 8.4315 1.3148 114.7324 77.5262 17.3902 3.3962 3.4136 19.1365 106.1772 13.2784 5.2607 5.0561 3.7234 5.7372 8.0243 13.3630 45.8803 1.8314 1.2065 1.6695 2.5260 38.5762 8.4709 30.7629 74.3527 42.2792 10.3077 4.7251 34.1229 12.2580 6.2034 7.4529 10.5218 3.4463 14.4033 73.7052 12.9251 9.6127 2.0836 1.6219 7.7138 11.8836 1.1317 26.8921 0.4941 33.3662 18.1828 6.1006 26.2368 12.5063 42.2322 15.0349 27.5053 32.4985 67.6490 18.5702 29.8544 4.3671 8.2570 0.9044 15.2076 27.6559 15.8781 13.0247 7.5811 2.5071 0.1867 3.7950 25.3645 119.9439 57.7322 14.6763 7.7413 19.6126 0.4972 7.7280 14.2439 29.2953 215.3935 233.1036 554.7778 30.2824 27.2613 18.7121 16.4032 0.6013 40.6582 72.3283 24.4145 66.4420 28.5460 30.1176 29.0269 4.9965 66.4947 13.4726 33.7902 10.7588 654.9044 25.5235 5.7390 37.7626
temp: 298.150 k
press: 1.00000 atm
elementType: 16 8 8 8 7 7 7 6 6 6 6 6 6 6 6 6 6 6 6 1 1 1 1 1 1 1 1 1 1 1 1 1 1 1 1 1 1 1 1 1
symmnumber: 1
zpe: 873266.1 jmol-1
zpe.correction: 0.332610 hartree
zpe.thermalcorrener: 0.352849 hartree
zpe.thermalcorrenthalpy: 0.353793 hartree
zpe.thermalcorrgfe: 0.280508 hartree
zpe.sumelectzpe: -1256.401375 hartree
zpe.sumelectthermal: -1256.381135 hartree
zpe.sumelectthermalent: -1256.380191 hartree
zpe.sumelectthermalfe: -1256.453476 hartree
dipole: -1.5415 5.6547 4.6775
dipole: 7.4987
quadrupole: -111.3298 -125.4129 -121.3163
quadrupole: -19.7055 3.5848 -7.0145
quadrupole: 8.0232 -6.0599 -1.9633 -19.7055 3.5848 -7.0145
hfenergy: -1256.7339847 hartree
pointgroup: C01 [X(C12H21N3O3S1)]
dipole: 1.4434823 2.1643466 -1.3913296 debye
polarizability: 205.2255539|-8.34335|174.7852061|10.1826304|5.0344964|134.0743961 unknown
InChI: InChI=1S/C12H21N3O3S/c16-6-5-13-10(17)4-2-1-3-9-11-8(7-19-9)14-12(18)15-11/h8-9,11,13-16H,1-7H2
charge 0 multiplicity 1
40 atoms
S  -3.842475 1.869705 0.805423
O  -1.961931 -2.649127 0.369505
O  1.523241 -0.426949 -0.124915
O  4.823813 -2.879979 1.5109
N  -1.412394 -0.437227 -0.33463
N  -3.490338 -1.180071 -0.710056
N  3.827621 -0.552839 -0.111677
C  -2.06127 0.698669 -0.993493
C  -3.514265 0.145729 -1.328114
C  -2.17623 1.995184 -0.114239
C  -4.584577 1.101674 -0.744851
C  -1.029937 2.183809 0.892092
C  0.345608 2.400815 0.211009
C  -2.249647 -1.540366 -0.159135
C  1.52973 2.160837 1.187821
C  2.796592 1.611482 0.489892
C  2.645751 0.140637 0.065965
C  3.856379 -1.950829 -0.590435
C  3.709559 -2.973764 0.553852
H  -1.525854 0.965944 -1.926287
H  -3.664922 0.069783 -2.425578
H  -2.257314 2.870117 -0.789588
H  -5.509008 0.570867 -0.46587
H  -4.824921 1.902808 -1.466555
H  -0.986867 1.273269 1.518131
H  -1.259191 3.033277 1.564751
H  -0.397741 -0.497038 -0.181856
H  -4.275696 -1.82451 -0.69432
H  0.444671 1.695668 -0.63207
H  0.404314 3.422143 -0.216798
H  1.787578 3.099753 1.714435
H  1.216234 1.437489 1.964265
H  3.015843 2.214293 -0.415671
H  3.679355 1.71119 1.152373
H  4.713972 -0.071984 0.049737
H  3.028926 -2.09096 -1.309471
H  4.817794 -2.114749 -1.108266
H  2.729109 -2.846583 1.052237
H  3.766966 -3.994236 0.140733
H  4.669419 -2.099529 2.099854
