program: Gaussian 09
title: 000125572
version: EM64L-G09RevD.01
frameworkgroup: C1[X(C15H14O6)]
method: RPBEPBE
basis: SDD
operation: Freq
keyword: #pfreq=noraman
keyword: PBEPBE/SDD
title: #p freq=noraman PBEPBE/SDD
converged: YES YES NO NO
title: Mulliken charges:
elementType: O O O O O O C C C C C C C C C C C C C C C H H H H H H H H H H H H H H
charge: -0.259164 -0.438179 -0.176549 -0.319281 -0.394391 -0.246433 0.237187 -0.505841 0.216919 0.146226 -0.418612 -0.217698 0.005897 0.353730 0.038754 -0.739843 0.182687 -0.562307 0.386158 -0.520089 -0.533913 0.274721 0.250089 0.263108 0.237606 0.238237 0.225628 0.229522 0.311555 0.350031 0.277434 0.389842 0.231471 0.231702 0.253798
chargesum: 0.00000
title: Mulliken charges with hydrogens summed into heavy atoms:
elementType: O O O O O O C C C C C C C C C C C C C C C
charge: -0.259164 -0.088149 -0.176549 -0.319281 -0.004550 -0.246433 0.237187 0.018969 0.216919 0.146226 0.082102 -0.217698 0.005897 0.353730 0.038754 -0.046456 0.182687 -0.250753 0.386158 -0.242654 0.183057
polarizability: 2.99333759e+02 6.32388054e+00 2.08795527e+02 -3.73001494e+00 2.29011639e+00 9.60188826e+01
1716.lowfreq: -0.5603 0.0004 0.0004 0.0007 5.9762 7.8626 31.0009 57.7414 76.9894
frequency: 30.9322 57.7003 76.9851 94.1277 121.1596 133.1838 163.3291 194.5838 205.2000 209.3190 219.4525 243.6226 248.0670 259.9196 264.0817 296.3534 309.5382 331.1866 363.5400 375.5529 398.6178 406.9868 427.8744 440.1869 477.1946 490.5767 510.6952 525.5265 537.8380 569.4859 607.2814 614.3079 628.1550 676.4947 681.8416 713.8745 715.3235 772.8178 795.0480 817.9447 858.1327 862.9800 903.1987 921.5471 935.6089 942.1571 958.7221 975.9738 1004.6651 1013.9806 1023.3718 1055.9176 1087.6124 1111.3085 1112.2282 1139.8419 1157.2529 1164.4174 1174.1241 1204.4185 1213.2332 1226.7333 1256.2657 1284.7097 1317.9735 1333.6333 1346.0019 1377.0528 1395.6699 1400.1663 1411.3079 1425.3764 1429.3956 1436.0221 1438.0689 1457.7647 1462.8882 1468.9074 1473.3523 1475.1292 1536.9883 1551.4397 1571.6593 1616.8765 1645.6492 2694.4454 2969.8851 2973.1653 2996.9836 3007.6308 3065.7081 3066.9321 3080.8181 3094.6825 3110.9964 3138.7743 3177.5944 3188.3040 3546.6808
redmass: 4.9185 4.6778 4.3251 4.5698 7.6661 4.6428 6.0303 3.6859 3.2455 1.6848 1.1276 3.5011 3.0442 3.1886 3.0866 4.6074 4.0867 3.7127 2.3743 3.0831 3.5113 2.2159 4.1377 7.2625 6.6222 4.2822 4.5791 6.2513 5.4780 5.8544 4.8647 5.9895 5.5390 5.6192 3.4637 5.1551 4.4713 4.7082 4.8631 4.4277 1.6815 5.9506 3.3806 1.7101 1.9898 2.6920 1.0774 2.2177 3.3967 4.5792 5.5306 4.3091 1.6122 1.6169 1.2610 1.7624 3.0039 1.9660 3.1764 1.4670 1.2273 1.4362 2.0981 2.1759 2.3489 4.0231 1.7861 2.4730 1.2773 3.7281 4.0649 1.1162 3.3977 1.2477 1.4975 1.0655 2.3896 1.0493 1.2816 1.0618 6.4661 4.6356 4.4016 5.6874 6.5786 1.0725 1.0675 1.0324 1.0367 1.0633 1.0963 1.1045 1.0924 1.0988 1.1005 1.1007 1.0924 1.0915 1.0653
irintensity: 1.7721 2.2401 2.1615 0.2099 0.5161 1.1742 8.1056 4.0252 9.7447 0.7082 0.5126 4.1299 1.6855 5.9023 3.4454 4.8438 0.2036 17.5199 68.0611 3.4227 62.9974 12.5867 4.6996 15.1131 3.9717 13.5470 29.5099 0.5238 4.2600 13.6762 18.5451 4.6737 2.4485 10.2303 10.2620 11.5966 0.2517 4.3375 18.5768 58.7420 40.9448 37.6908 48.7770 4.4102 18.0794 9.1834 127.7949 2.1388 15.0348 35.1175 48.3413 7.5795 104.4923 26.7003 0.1375 51.2298 44.3603 53.8524 82.0785 18.1524 2.8856 46.5147 7.8491 100.0668 190.4362 426.2167 128.1230 43.3924 38.4909 39.2934 92.3228 15.3422 64.6207 50.6710 55.2781 9.3065 49.0917 15.6966 7.1382 6.2787 170.4317 77.0669 99.6579 311.0908 33.9763 149.8333 17.3959 56.7488 15.3316 3.4741 1.2036 35.9790 2.7805 20.4461 15.2558 18.8243 2.9664 2.3819 6.2054
temp: 298.150 k
press: 1.00000 atm
elementType: 8 8 8 8 8 8 6 6 6 6 6 6 6 6 6 6 6 6 6 6 6 1 1 1 1 1 1 1 1 1 1 1 1 1 1
symmnumber: 1
zpe: 689516.9 jmol-1
zpe.correction: 0.262623 hartree
zpe.thermalcorrener: 0.281169 hartree
zpe.thermalcorrenthalpy: 0.282113 hartree
zpe.thermalcorrgfe: 0.216796 hartree
zpe.sumelectzpe: -1029.818816 hartree
zpe.sumelectthermal: -1029.800270 hartree
zpe.sumelectthermalent: -1029.799326 hartree
zpe.sumelectthermalfe: -1029.864643 hartree
dipole: -1.2783 -0.2132 0.0810
dipole: 1.2985
quadrupole: -79.4237 -137.6855 -123.0771
quadrupole: 1.2421 1.9307 2.7527
quadrupole: 33.9717 -24.2901 -9.6817 1.2421 1.9307 2.7527
hfenergy: -1030.0814388 hartree
pointgroup: C01 [X(C15H14O6)]
dipole: 0.5036947 0.0798397 0.0300903 debye
polarizability: 299.4531628|5.5881851|208.6991795|2.9923123|-2.3546561|95.9958258 unknown
InChI: InChI=1S/C15H14O6/c1-15(19)5-9-10(6-21-15)14(18)12-8(13(9)17)3-7(20-2)4-11(12)16/h3-4,16,19H,5-6H2,1-2H3
charge 0 multiplicity 1
35 atoms
O  -3.911429 -0.808679 -0.561981
O  -4.063952 0.293859 1.573658
O  -0.296605 2.689748 -0.103674
O  -0.190658 -2.803564 -0.030136
O  2.352419 -2.818641 0.051688
O  4.630267 1.489395 0.047339
C  -4.035199 0.495709 0.120295
C  -2.805072 1.380786 -0.144757
C  -1.504297 0.612493 -0.107423
C  -1.47103 -0.763679 -0.101371
C  -2.740094 -1.58237 -0.132348
C  -0.245102 1.417398 -0.084446
C  -0.188455 -1.498258 -0.047051
C  1.058592 0.679079 -0.039901
C  1.057449 -0.750991 -0.019048
C  -5.344972 1.088263 -0.39995
C  2.310746 -1.448966 0.02861
C  2.262819 1.39007 -0.01653
C  3.500969 0.678631 0.02888
C  3.533603 -0.730884 0.051901
C  5.947612 0.839293 0.093898
H  -2.770529 2.196549 0.598281
H  -2.907807 1.871219 -1.131176
H  -2.651208 -2.415751 -0.847753
H  -2.914997 -2.020148 0.872492
H  -5.314543 1.189299 -1.497393
H  -6.19191 0.426068 -0.144657
H  -5.516828 2.080758 0.050175
H  2.259785 2.48314 -0.032377
H  -4.878982 -0.224592 1.801115
H  4.46337 -1.302803 0.086867
H  1.366526 -3.152006 0.027345
H  6.106695 0.203635 -0.797419
H  6.057481 0.233382 1.012914
H  6.671932 1.665659 0.10003
