program: Gaussian 09
title: 000125542
version: EM64L-G09RevD.01
frameworkgroup: C1[X(C11H10N2O4)]
method: RPBEPBE
basis: SDD
operation: Freq
keyword: #p
keyword: freq=noraman
keyword: PBEPBE/SDD
title: #p freq=noraman PBEPBE/SDD
converged: YES YES NO NO
title: Mulliken charges:
elementType: O O O O N N C C C C C C C C C C C H H H H H H H H H H
charge: -0.239733 -0.185185 -0.185446 -0.219157 -0.109633 -0.678427 -0.501756 -0.501517 0.212523 0.211717 0.250590 0.184566 -0.330804 -0.300742 0.505223 -0.399444 -0.395804 0.268169 0.264756 0.264890 0.267816 0.264120 0.270453 0.225933 0.225007 0.316140 0.315745
chargesum: 0.00000
title: Mulliken charges with hydrogens summed into heavy atoms:
elementType: O O O O N N C C C C C C C C C C C
charge: -0.239733 -0.185185 -0.185446 -0.219157 -0.109633 -0.046543 0.031169 0.031189 0.212523 0.211717 0.250590 0.184566 -0.066684 -0.030289 0.505223 -0.173510 -0.170797
polarizability: 2.49349817e+02 -1.13613841e+00 1.05112512e+02 1.22072317e+01 -1.99975684e+00 1.19276703e+02
1716.lowfreq: -7.5621 0.0005 0.0006 0.0009 1.4081 6.3274 25.7540 29.5041 57.0227
frequency: 25.7325 29.4935 56.9946 62.5131 80.9734 107.5447 112.9511 132.2876 243.4638 260.7604 311.9715 331.5819 362.3935 375.8327 409.2119 430.5019 445.3917 446.4815 504.9176 534.4824 548.5482 550.3172 568.6729 616.2594 630.5276 634.8334 660.1661 702.7468 742.9019 747.1436 817.2698 818.5969 823.7618 843.1327 923.3359 973.6137 980.8834 996.3672 1002.0348 1006.2530 1015.5510 1022.7177 1041.1114 1137.3995 1145.6902 1171.4881 1187.8266 1209.6672 1226.3689 1252.5372 1291.4609 1299.3115 1315.7226 1334.4379 1392.0567 1437.1446 1453.2924 1455.8492 1519.8853 1568.0380 1632.2104 1648.0136 1660.9672 1685.2790 1717.9712 3028.4414 3037.7109 3083.1537 3100.7327 3129.3996 3133.0393 3162.0502 3180.7498 3557.3104 3696.5088
redmass: 5.2951 5.9800 4.6977 4.6018 2.2149 7.6463 6.1821 7.5145 7.2737 6.3106 9.4354 8.3102 4.5094 5.9098 2.3530 1.1097 1.2813 4.7887 2.8837 3.5452 4.1265 3.0053 10.0044 7.4880 6.9872 6.1594 4.5026 7.4739 11.4412 4.2062 2.9720 1.9056 1.2626 1.8313 8.6054 1.3620 1.3543 3.0380 2.6913 2.1724 5.6329 1.4455 5.7916 1.2185 1.1952 11.6239 1.1649 1.1122 2.8296 2.6474 1.4888 2.8973 1.3244 2.9555 4.3591 1.0739 1.0912 4.4970 3.1023 6.8496 4.2824 1.3002 12.6467 11.7219 12.5584 1.0592 1.0629 1.1038 1.1020 1.0892 1.0899 1.0959 1.0953 1.0453 1.1040
irintensity: 2.3970 3.0414 7.0506 0.2906 0.0307 8.8341 0.1028 0.1264 8.9843 3.6189 2.9081 0.8370 2.6527 21.9171 0.0009 0.1410 302.2952 18.4896 0.0089 0.0366 0.8568 1.8530 25.1974 0.5427 8.0923 40.3037 38.6678 70.3629 105.2725 7.5363 4.2806 20.3594 0.1032 74.9636 239.6566 0.0038 0.0936 134.9542 11.0034 0.0369 3.8542 7.7068 106.6847 14.0348 1.0706 229.5863 166.4607 0.0972 10.7635 190.5363 2.0183 81.6509 2.2501 119.4126 11.4594 0.6768 29.8622 4.9799 49.4589 17.4587 311.1180 434.9016 600.5193 207.0823 11.3754 13.1320 3.6701 0.0041 7.2857 12.0372 19.4733 8.0868 1.9688 134.5583 26.0547
temp: 298.150 k
press: 1.00000 atm
elementType: 8 8 8 8 7 7 6 6 6 6 6 6 6 6 6 6 6 1 1 1 1 1 1 1 1 1 1
symmnumber: 1
zpe: 519083.2 jmol-1
zpe.correction: 0.197708 hartree
zpe.thermalcorrener: 0.213051 hartree
zpe.thermalcorrenthalpy: 0.213995 hartree
zpe.thermalcorrgfe: 0.152949 hartree
zpe.sumelectzpe: -834.341492 hartree
zpe.sumelectthermal: -834.326149 hartree
zpe.sumelectthermalent: -834.325205 hartree
zpe.sumelectthermalfe: -834.386250 hartree
dipole: -3.9232 0.1311 -1.0227
dipole: 4.0564
quadrupole: -34.2474 -117.6308 -92.1876
quadrupole: -0.0470 2.5542 -1.9573
quadrupole: 47.1079 -36.2755 -10.8324 -0.0470 2.5542 -1.9573
hfenergy: -834.5391999 hartree
pointgroup: C01 [X(C11H10N2O4)]
dipole: -1.5395685 -0.2397045 0.3453131 debye
polarizability: 249.0946785|6.848763|110.0991691|-11.6895215|-7.1354753|114.5451841 unknown
InChI: InChI=1S/C11H10N2O4/c12-8-3-1-7(2-4-8)11(16)17-13-9(14)5-6-10(13)15/h1-4H,5-6,12H2
charge 0 multiplicity 1
27 atoms
O  0.779711 -0.348766 0.557437
O  2.45221 1.822416 1.505276
O  2.396464 -2.147572 -1.038949
O  0.527291 0.942884 -1.418747
N  2.166591 -0.211106 0.31444
N  -5.618339 -0.254193 0.443987
C  4.348064 0.670906 0.329374
C  4.331106 -0.639938 -0.502833
C  2.910462 0.892115 0.813665
C  2.88245 -1.140931 -0.487211
C  -1.452048 0.159557 -0.205941
C  -0.026201 0.33601 -0.486111
C  -2.387729 0.762925 -1.094886
C  -1.938756 -0.585256 0.906165
C  -4.2549 -0.117899 0.23107
C  -3.76441 0.630271 -0.884841
C  -3.3151 -0.723279 1.122853
H  4.653106 1.549946 -0.263076
H  5.01595 0.618178 1.205886
H  4.983925 -1.425238 -0.08508
H  4.634166 -0.485618 -1.552089
H  -2.008236 1.334029 -1.948737
H  -1.227736 -1.052022 1.592755
H  -4.473571 1.09992 -1.576593
H  -3.678313 -1.29962 1.981849
H  -5.973456 -0.785103 1.234724
H  -6.291102 0.173483 -0.186685
