program: Gaussian 09
title: 000125541
version: EM64L-G09RevD.01
frameworkgroup: C1[X(C11H10N2O4)]
method: RPBEPBE
basis: SDD
operation: Freq
keyword: #p
keyword: freq=noraman
keyword: PBEPBE/SDD
title: #p freq=noraman PBEPBE/SDD
converged: YES YES NO NO
title: Mulliken charges:
elementType: O O O O N N C C C C C C C C C C C H H H H H H H H H H
charge: -0.227509 -0.182614 -0.182439 -0.209751 -0.114217 -0.698978 -0.501355 -0.501446 0.212884 0.213512 0.286197 0.190815 -0.530767 -0.363669 0.513190 -0.182500 -0.401616 0.268857 0.266906 0.266838 0.268927 0.259388 0.271721 0.228636 0.223624 0.314955 0.310410
chargesum: 0.00000
title: Mulliken charges with hydrogens summed into heavy atoms:
elementType: O O O O N N C C C C C C C C C C C
charge: -0.227509 -0.182614 -0.182439 -0.209751 -0.114217 -0.073614 0.034408 0.034319 0.212884 0.213512 0.286197 0.190815 -0.271378 -0.091948 0.513190 0.046136 -0.177991
polarizability: 2.17356461e+02 -1.54317469e+00 1.12747564e+02 -2.62144485e+00 1.21065386e+01 1.23828609e+02
1716.lowfreq: -1.9488 -0.0011 -0.0009 -0.0008 4.7289 6.7009 20.7026 32.1097 54.9158
frequency: 20.5770 32.1018 54.9120 56.7456 79.8753 106.2431 142.9765 156.6338 215.3995 223.3620 296.6475 327.7814 374.8645 375.8138 382.5537 393.6872 426.6795 462.6766 531.5946 533.8422 538.1133 550.5062 553.0805 574.4950 634.9387 649.2996 678.2790 708.2235 710.8898 756.5151 803.3407 817.9361 840.9744 891.0228 908.4347 975.8563 980.5028 991.7640 995.2253 1006.5797 1015.5032 1039.0754 1053.7944 1106.0937 1146.2491 1169.3614 1180.7537 1190.4628 1209.0857 1235.9391 1292.2506 1296.8457 1306.5717 1332.3263 1406.5378 1437.2785 1453.2999 1460.6513 1488.6649 1588.9314 1627.3780 1646.1711 1662.4738 1684.2877 1719.5071 3029.4453 3038.5180 3084.3209 3101.6526 3124.0577 3143.5058 3153.4671 3194.0307 3567.5726 3707.4640
redmass: 5.2678 7.2086 6.1820 4.6855 2.1214 7.7927 7.1386 5.4496 3.4776 6.7511 13.2792 7.5674 1.1040 6.6981 5.0166 1.1787 2.9599 5.0421 3.9546 6.1475 4.0980 4.5234 2.7802 12.7390 6.2288 7.8516 2.4191 7.2462 3.4349 12.5987 1.5751 1.4859 6.6725 1.5800 1.4878 4.5154 1.3472 2.4813 3.1574 2.1686 5.6327 5.2357 1.7999 1.5098 1.1957 11.6856 1.3029 1.7741 1.1104 2.5435 1.4893 2.6730 1.4882 2.2505 8.2412 1.0738 1.0908 3.5366 2.9297 6.1890 3.5944 1.3402 12.6547 12.7154 12.6453 1.0593 1.0629 1.1038 1.1020 1.0884 1.0918 1.0940 1.0957 1.0451 1.1041
irintensity: 0.7557 3.7123 0.4790 5.5271 0.0059 9.5984 0.3861 0.0004 5.3367 10.0375 0.0499 1.1715 86.4969 16.7769 4.7923 231.8318 0.0422 2.4867 0.8234 0.3416 0.9178 2.9509 1.4950 21.0445 54.3563 4.7304 4.5780 10.7881 48.7546 81.0259 31.4517 10.5306 184.9548 15.2101 14.2791 80.3986 0.7477 20.9533 125.3085 0.0887 4.0233 89.8930 17.0751 14.1610 1.1107 231.1437 42.2067 63.0172 0.0432 71.0846 2.0984 48.4970 50.4968 111.7191 23.8315 0.6840 29.3274 82.1659 46.2534 25.3761 45.2603 250.2970 595.7584 196.0191 10.3309 12.4153 2.8140 0.0017 6.4927 13.7034 7.5985 23.5800 1.7963 79.1214 23.6042
temp: 298.150 k
press: 1.00000 atm
elementType: 8 8 8 8 7 7 6 6 6 6 6 6 6 6 6 6 6 1 1 1 1 1 1 1 1 1 1
symmnumber: 1
zpe: 518308.9 jmol-1
zpe.correction: 0.197413 hartree
zpe.thermalcorrener: 0.212861 hartree
zpe.thermalcorrenthalpy: 0.213805 hartree
zpe.thermalcorrgfe: 0.152462 hartree
zpe.sumelectzpe: -834.336295 hartree
zpe.sumelectthermal: -834.320848 hartree
zpe.sumelectthermalent: -834.319904 hartree
zpe.sumelectthermalfe: -834.381247 hartree
dipole: -2.0717 -0.4744 -0.7997
dipole: 2.2708
quadrupole: -45.0402 -110.1483 -96.9662
quadrupole: 1.9543 3.0615 12.3933
quadrupole: 39.0113 -26.0968 -12.9146 1.9543 3.0615 12.3933
hfenergy: -834.5337086 hartree
pointgroup: C01 [X(C11H10N2O4)]
dipole: -0.8143963 0.256414 -0.2629627 debye
polarizability: 217.3654896|1.6826852|116.7661669|-2.3811871|-13.2219722|119.8009775 unknown
InChI: InChI=1S/C11H10N2O4/c12-8-3-1-2-7(6-8)11(16)17-13-9(14)4-5-10(13)15/h1-3,6H,4-5,12H2
charge 0 multiplicity 1
27 atoms
O  0.798782 -0.498798 0.537426
O  2.405871 1.569127 1.779193
O  2.389696 -1.828108 -1.491264
O  0.298216 1.0942 -1.139166
N  2.152406 -0.213037 0.232005
N  -4.909293 1.061844 -1.088433
C  4.276107 0.796783 0.292276
C  4.2713 -0.323477 -0.783381
C  2.866687 0.822469 0.894339
C  2.8586 -0.918597 -0.780264
C  -1.524998 -0.02876 0.063177
C  -0.126095 0.294589 -0.291334
C  -2.536213 0.650223 -0.660179
C  -1.853475 -0.968555 1.076092
C  -3.90665 0.400146 -0.382625
C  -3.215887 -1.212991 1.348299
C  -4.232661 -0.545213 0.636753
H  4.491964 1.793361 -0.128309
H  5.005228 0.6171 1.100502
H  4.995696 -1.128303 -0.571789
H  4.48764 0.054123 -1.796835
H  -2.241885 1.368444 -1.433999
H  -1.064758 -1.484467 1.626898
H  -3.491835 -1.933457 2.12567
H  -5.285696 -0.750856 0.86545
H  -4.678868 1.733636 -1.814563
H  -5.889677 0.884674 -0.89144
