program: Gaussian 09
title: 000125543
version: EM64L-G09RevD.01
frameworkgroup: C1[X(C12H10N4O2)]
method: RPBEPBE
basis: SDD
operation: Freq
keyword: #p
keyword: freq=noraman
keyword: PBEPBE/SDD
title: #p freq=noraman PBEPBE/SDD
converged: YES YES NO NO
title: Mulliken charges:
elementType: O O N N N N C C C C C C C C C C C C H H H H H H H H H H
charge: -0.165936 -0.223809 -0.199936 0.017010 -0.018427 0.071130 0.127007 -0.168870 0.508522 0.414876 -0.091380 0.090210 -0.559470 -0.629360 -0.847193 -0.326515 -0.175752 -0.368382 0.264989 0.267190 0.250628 0.265938 0.234852 0.254843 0.240550 0.287740 0.234781 0.244763
chargesum: 0.00000
title: Mulliken charges with hydrogens summed into heavy atoms:
elementType: O O N N N N C C C C C C C C C C C C
charge: -0.165936 -0.223809 -0.199936 0.017010 -0.018427 0.071130 0.127007 -0.168870 0.508522 0.414876 -0.091380 0.090210 -0.294481 0.154396 -0.116947 -0.038774 0.059029 -0.123620
polarizability: 2.97070536e+02 -6.46345780e+00 1.97251912e+02 1.21663315e+00 -2.64425828e+00 7.17771965e+01
1716.lowfreq: -5.7756 -2.3745 -0.0005 -0.0003 0.0003 6.2962 33.8107 62.6768 76.1726
frequency: 33.6975 62.6693 76.1710 108.0020 116.6975 144.2219 183.5009 240.6778 252.9954 260.4904 289.8960 303.6704 317.7025 341.8470 356.3437 426.8376 435.8294 463.8445 498.7479 543.4001 566.9654 589.7261 617.3448 631.5553 653.2009 689.6521 698.3600 718.8598 744.0742 796.4703 796.8758 843.2525 883.3246 907.8014 929.1553 950.5605 997.5610 1011.3618 1027.9724 1049.1492 1068.4323 1085.2151 1117.7926 1123.3881 1149.4570 1173.1441 1209.5678 1238.5836 1285.9726 1300.6617 1325.2985 1338.3270 1358.9603 1362.6637 1392.3623 1401.6468 1406.4696 1423.7092 1448.8932 1459.5451 1471.5881 1475.2995 1484.8432 1492.7070 1524.9933 1554.8692 1574.4958 1623.3464 2977.3479 3031.8835 3056.6703 3093.1766 3124.1572 3128.9262 3154.0803 3154.7903 3168.8159 3174.8180
redmass: 5.2669 2.9093 6.1927 3.8991 1.3699 6.1314 5.3626 1.9897 4.3867 1.6072 4.4196 4.1356 5.0193 5.6969 3.6414 6.8721 6.0738 4.1872 5.5336 4.6743 3.3689 8.3235 7.9685 6.2002 6.6373 6.0947 9.3933 8.8891 6.2656 2.1491 2.9093 2.9157 4.3779 1.5111 6.6016 1.4293 1.3709 1.6613 2.6699 1.5335 2.7157 2.5281 2.8708 1.5596 1.8252 2.2271 3.4053 2.0684 4.0472 2.9948 3.5838 5.2429 6.7621 10.1180 3.4124 2.0186 1.5026 2.5716 2.1027 1.1513 1.1161 1.7650 1.0957 1.1653 5.5598 6.6905 6.2256 7.8304 1.0392 1.0371 1.0970 1.0975 1.0999 1.0896 1.0917 1.0904 1.0999 1.1000
irintensity: 0.8695 3.3655 0.2355 6.3112 1.1974 3.8280 0.0106 0.2667 3.7380 0.3043 0.6109 2.6764 3.0999 0.5129 0.8242 0.9044 3.0068 0.0943 1.1984 0.4355 3.5026 5.8525 13.7568 2.7850 3.1459 1.0683 0.5952 22.0930 0.7198 21.4112 16.2741 21.1102 0.1175 19.9193 1.5781 0.1090 1.3900 6.1900 1.1148 6.4955 8.5188 1.5849 25.9081 13.5467 16.8009 201.9996 243.6206 5.3381 43.4784 13.2203 28.2070 16.9804 103.6148 176.0493 12.8671 3.6592 14.4351 6.9121 6.4396 16.6912 8.1873 38.1926 22.7636 18.6977 24.9470 33.1136 3.6173 11.5858 27.4607 18.6678 15.5342 13.8434 7.4816 20.8129 5.3775 10.0724 7.1302 17.5208
temp: 298.150 k
press: 1.00000 atm
elementType: 8 8 7 7 7 7 6 6 6 6 6 6 6 6 6 6 6 6 1 1 1 1 1 1 1 1 1 1
symmnumber: 1
zpe: 541294.4 jmol-1
zpe.correction: 0.206168 hartree
zpe.thermalcorrener: 0.220856 hartree
zpe.thermalcorrenthalpy: 0.221800 hartree
zpe.thermalcorrgfe: 0.163879 hartree
zpe.sumelectzpe: -831.392166 hartree
zpe.sumelectthermal: -831.377479 hartree
zpe.sumelectthermalent: -831.376534 hartree
zpe.sumelectthermalfe: -831.434455 hartree
dipole: 1.7956 4.5640 0.2939
dipole: 4.9133
quadrupole: -116.8626 -96.2616 -104.5977
quadrupole: -23.2539 -1.7906 1.0752
quadrupole: -10.9553 9.6457 1.3096 -23.2539 -1.7906 1.0752
hfenergy: -831.5983342 hartree
pointgroup: C01 [X(C12H10N4O2)]
dipole: 0.7398717 1.7798674 0.145851 debye
polarizability: 296.758615|-8.3891495|197.587845|2.6390086|-0.9611003|71.7531849 unknown
InChI: InChI=1S/C12H10N4O2/c1-7-6-9-8(4-3-5-13-9)10-11(7)15(2)12(14-10)16(17)18/h3-6H,1-2H3
charge 0 multiplicity 1
28 atoms
O  -3.537877 -2.437335 0.166898
O  -4.403154 -0.389709 -0.386419
N  -1.849528 0.788615 0.026781
N  -0.969022 -1.342682 -0.024561
N  3.726615 0.336792 0.007178
N  -3.414672 -1.181742 -0.074895
C  -0.447522 0.929572 0.030352
C  0.063198 -0.412562 0.000604
C  0.424058 2.078027 0.040426
C  1.471208 -0.683577 -0.007293
C  2.345736 0.461365 0.011895
C  -2.085468 -0.597958 -0.014581
C  1.792529 1.794228 0.029347
C  -2.860042 1.864925 0.114601
C  -0.043448 3.522865 0.045205
C  2.04433 -1.986773 -0.032775
C  3.440166 -2.101919 -0.036379
C  4.236516 -0.91523 -0.015652
H  2.519177 2.613467 0.0278
H  -3.670487 1.562513 0.792612
H  -2.381309 2.771019 0.503445
H  -3.305277 2.065042 -0.873096
H  -0.536201 3.800125 0.996604
H  0.821007 4.195257 -0.077853
H  -0.750016 3.737867 -0.777101
H  1.387936 -2.862035 -0.048136
H  3.928238 -3.081008 -0.054986
H  5.330608 -0.986849 -0.018323
