program: Gaussian 09
title: 000125530
version: EM64L-G09RevD.01
frameworkgroup: C1[X(C13H7Cl2IO)]
method: RPBEPBE
basis: SDD
operation: Freq
keyword: #p
keyword: freq=noraman
keyword: PBEPBE/SDD
title: #p freq=noraman PBEPBE/SDD
converged: NO NO NO NO
title: Mulliken charges:
elementType: I Cl Cl O C C C C C C C C C C C C C H H H H H H H
charge: 0.099579 -0.024713 -0.035042 -0.259023 0.258637 0.358862 -0.035762 0.217996 0.358410 -0.329810 -0.309173 -0.259437 -0.365201 -0.372877 -0.799332 -0.261857 -0.084677 0.284424 0.254974 0.286926 0.256824 0.239768 0.239776 0.280730
chargesum: 0.00000
title: Mulliken charges with hydrogens summed into heavy atoms:
elementType: I Cl Cl O C C C C C C C C C C C C C
charge: 0.099579 -0.024713 -0.035042 -0.259023 0.258637 0.358862 -0.035762 0.217996 0.358410 -0.045387 -0.309173 -0.004463 -0.078275 -0.372877 -0.062964 0.018872 -0.084677
polarizability: 3.29052256e+02 1.68931023e+00 1.98726798e+02 9.63993816e-03 1.20591327e-02 6.68985643e+01
1716.lowfreq: -59.3387 -0.0011 -0.0005 0.0016 0.7987 6.8872 7.9400 34.3284 74.5601
frequency: -59.3344 34.3275 74.5549 78.9874 120.5594 161.4801 162.3646 170.6764 188.2860 200.4226 244.9005 247.9206 313.7155 318.4488 370.8918 377.1679 423.2394 486.9082 513.8523 520.0202 531.5577 568.5803 581.4967 596.0229 638.7242 683.2022 716.9773 764.0293 778.5749 819.5543 850.1343 858.4212 874.4748 896.6019 899.4404 908.0984 993.7677 1044.8911 1059.5862 1083.0920 1103.1328 1155.1183 1182.0012 1202.7779 1252.7305 1277.9161 1348.7408 1367.4468 1393.1156 1401.1664 1413.1177 1435.0761 1459.8406 1474.7299 1476.9493 1564.7235 1584.5714 1609.1850 1634.4365 2989.0594 3067.4021 3107.9522 3155.0629 3185.3750 3193.5950 3195.8194
redmass: 1.0181 20.9773 22.8393 6.0007 7.0659 11.0156 7.0599 17.0293 5.5183 3.7387 4.8198 5.5440 12.0641 6.4174 8.0797 12.4509 5.1050 6.0928 4.2976 6.2576 4.7066 4.7565 3.7873 5.5754 6.7716 9.8957 5.3660 5.5469 10.0632 7.6400 1.4193 1.4046 1.3713 1.4291 6.5529 11.2006 1.6267 1.4971 2.3046 2.1905 2.6554 3.8512 2.9809 2.2534 1.3038 3.8397 3.6559 4.3913 3.5702 1.3892 5.5506 3.5870 3.4501 1.2381 1.0450 9.1034 7.8653 9.1661 9.0004 1.0378 1.0980 1.0987 1.0921 1.0930 1.0942 1.0934
irintensity: 0.2886 0.0007 0.0212 0.5621 0.5380 0.2384 0.7488 0.5379 0.9280 0.6204 1.3158 0.7093 3.9600 0.0023 0.0243 3.1360 7.7454 3.6744 0.2620 14.4058 0.3278 0.6050 21.9000 1.4793 0.6632 7.8264 0.0013 8.3203 110.1359 15.6591 42.0425 13.0117 24.0523 9.4645 5.0866 121.5947 1.0147 6.6242 27.2604 17.6475 16.3073 130.6213 2.1900 2.6951 8.7428 11.9510 37.7421 60.3166 11.6838 22.1854 66.3655 2.3051 92.9574 2.6002 15.2843 91.8453 5.1468 61.2961 43.8295 22.6565 13.9531 6.4809 2.4172 1.3743 1.3440 0.3923
temp: 298.150 k
press: 1.00000 atm
elementType: 53 17 17 8 6 6 6 6 6 6 6 6 6 6 6 6 6 1 1 1 1 1 1 1
symmnumber: 1
zpe: 415026.4 jmol-1
zpe.correction: 0.158075 hartree
zpe.thermalcorrener: 0.172405 hartree
zpe.thermalcorrenthalpy: 0.173349 hartree
zpe.thermalcorrgfe: 0.114491 hartree
zpe.sumelectzpe: -1505.277687 hartree
zpe.sumelectthermal: -1505.263357 hartree
zpe.sumelectthermalent: -1505.262413 hartree
zpe.sumelectthermalfe: -1505.321271 hartree
dipole: -0.1819 2.0691 0.0002
dipole: 2.0770
quadrupole: -130.0601 -115.7874 -129.9094
quadrupole: -3.2047 -0.0003 0.0007
quadrupole: -4.8078 9.4649 -4.6571 -3.2047 -0.0003 0.0007
hfenergy: -1505.4357623 hartree
pointgroup: C01 [X(C13H7Cl2I1O1)]
dipole: -0.2557055 -0.7761331 -0.0000945 debye
dipolederiv: -0.3502593 0.2250345 0.0000506 0.2927876 -0.2144806 -0.0000028 0.0001572 -0.0001492 -0.0021464 -0.1503551 0.1526704 0.0000384 0.0133689 -0.6806254 -0.000138 0.0000111 -0.0000928 -0.0424514 -0.9615966 0.1677867 0.000077 0.1945325 -0.1599309 -0.0000163 0.0001491 -0.0000764 -0.0529608 -1.3876792 -0.0183656 -0.0000087 -0.0497336 -0.5025094 -0.000059 0.0000125 0.0000473 -0.1460944 0.1549146 -0.0781777 -0.0000069 0.0887959 0.0156555 0.0000465 -0.0000145 -0.000054 0.0378629 0.072102 0.196851 0.0000527 -0.2502815 -0.4625455 -0.0000755 0.0001411 -0.0000933 0.0127512 0.6385557 -0.2728592 0.0000005 -0.6200977 0.0427383 0.0000012 -0.0000486 0.0000033 0.0439079 0.7329598 0.1592262 -0.0000373 0.627452 0.4071619 0.0000575 0.0000022 -0.0000662 0.0972127 0.0980676 0.1384031 0.0000114 0.2523795 0.3557373 0.0000321 0.0000049 0.0000188 -0.0204025 -0.2514158 0.1901287 0.0000232 0.223209 -0.1887803 -0.0000349 0.0000399 -0.0000333 -0.1070456 0.4577987 -0.2908218 -0.0000689 0.1384598 1.0752748 0.0002539 -0.0000364 0.0001826 -0.0499935 -0.3600816 0.2855478 0.0000412 0.1671906 -0.2391068 0.0000189 -0.0000378 0.000103 -0.1320297 -0.4772114 -0.068461 0.0000346 -0.0412728 -0.110968 -0.0000116 0.0000332 0.0000782 -0.1374813 0.7364796 -0.6598782 -0.0000957 -0.8352573 0.4595496 0.0000058 -0.0002236 0.0001692 -0.1593703 -0.0343064 -0.0704462 -0.000002 -0.0214532 -0.128633 -0.0000125 -0.000235 0.0000451 0.0636252 -0.5603713 0.2271626 0.0000207 0.2426412 -0.3557106 -0.000058 0.0000295 -0.0000107 -0.0845076 1.3128099 -0.1906345 -0.0001435 -0.3531137 0.4119285 0.0000476 -0.0002912 0.0001388 -0.06927 0.134825 -0.036732 -0.000005 -0.005771 0.0153267 -0.0000083 0.0000065 0.000008 0.164718 -0.0343166 -0.0581661 -0.0000027 -0.0479954 0.0890972 -0.0000025 0.0000337 -0.0000245 0.1539458 0.0988281 0.0128605 0.0000093 0.0276688 0.036917 -0.0000197 0.0000443 -0.0000574 0.1918558 -0.005633 0.1238862 -0.0000245 0.0605033 0.0332173 0.0000021 -0.0000015 0.0000177 0.1168388 0.0388247 -0.0481602 0.102576 -0.0333073 0.0201822 0.0147268 0.1061746 0.0757689 -0.0274466 0.0389747 -0.0481772 -0.1025545 -0.0332334 0.0201196 -0.0147366 -0.1059716 -0.07587 -0.0275307 0.058086 -0.038678 0.000014 -0.0374722 0.0603846 -0.0000167 0.0000203 -0.000053 0.1760125 unknown
polarizability: 321.4937823|-30.5087664|206.2852723|-0.0066289|0.0139431|66.8985643 unknown
InChI: InChI=1S/C13H7Cl2IO/c1-6-2-8(16)5-9-12-10(15)3-7(14)4-11(12)17-13(6)9/h2-5H,1H3
charge 0 multiplicity 1
24 atoms
I  -4.680249 2.27979 0.000189
Cl 1.264809 3.199138 0.000572
Cl 5.270675 -0.632059 -0.000249
O  0.136966 -1.818265 -0.000078
C  -0.697779 0.380329 0.000075
C  0.762108 0.439872 0.000113
C  -1.033764 -1.006774 -0.000026
C  1.221454 -0.914624 -0.000029
C  -2.343458 -1.51193 -0.000077
C  -1.734198 1.342781 0.000113
C  1.747397 1.448535 0.000218
C  -3.367323 -0.527075 -0.000041
C  2.568015 -1.297561 -0.000059
C  -3.057938 0.857135 0.000058
C  -2.644989 -2.997643 -0.000193
C  3.117985 1.127304 0.000048
C  3.496376 -0.23777 -0.000078
H  -1.513748 2.411258 0.000173
H  -4.41221 -0.853644 -0.000078
H  2.874892 -2.345031 -0.000136
H  -1.717006 -3.591148 -0.000029
H  -3.235206 -3.282017 0.890075
H  -3.234846 -3.281955 -0.890722
H  3.876338 1.913654 0.000062
