program: Gaussian 09
title: 000125597
version: EM64L-G09RevD.01
frameworkgroup: C1[X(C23H30N4O3)]
method: RPBEPBE
basis: SDD
operation: Freq
keyword: #p
keyword: freq=noraman
keyword: PBEPBE/SDD
title: #p freq=noraman PBEPBE/SDD
converged: YES YES NO NO
title: Mulliken charges:
elementType: O O O N N N N C C C C C C C C C C C C C C C C C C C C C C C H H H H H H H H H H H H H H H H H H H H H H H H H H H H H H
charge: -0.288211 -0.342324 -0.240236 -0.148735 -0.379646 -0.455215 -0.614917 -0.240929 -0.482818 -0.488096 -0.359452 0.215526 -0.276797 -0.010500 0.239719 -0.355318 -0.744012 0.161433 -0.404184 -0.735586 0.524199 -0.683012 -0.372046 0.422328 0.385724 -0.426364 -0.421870 -0.411255 -0.242215 -0.246410 0.300910 0.269317 0.223247 0.229763 0.264183 0.225338 0.237890 0.270525 0.182146 0.390573 0.211263 0.197979 0.242414 0.242429 0.209335 0.205166 0.222361 0.194448 0.216119 0.265975 0.315171 0.321879 0.273139 0.228829 0.310089 0.238281 0.236079 0.241318 0.227099 0.227957
chargesum: 0.00000
title: Mulliken charges with hydrogens summed into heavy atoms:
elementType: O O O N N N N C C C C C C C C C C C C C C C C C C C C C C C
charge: -0.288211 -0.342324 -0.240236 -0.148735 0.010927 -0.140044 -0.019899 0.059980 0.009745 0.005850 0.103776 0.215526 -0.006272 0.171646 0.239719 0.053924 -0.049835 0.161433 0.023343 -0.059043 0.524199 -0.454182 -0.061957 0.422328 0.385724 -0.188083 -0.185791 -0.169937 -0.015116 -0.018453
polarizability: 4.44392800e+02 2.83800759e+00 2.66749992e+02 3.30326068e+00 -1.35190340e+01 1.99673611e+02
1716.lowfreq: -15.5379 -9.5969 -5.6562 -0.0006 0.0008 0.0009 3.3342 12.7242 18.7639
frequency: -11.9993 12.2037 18.4677 30.4949 32.6815 44.1500 57.3189 67.4117 71.8843 85.1672 90.8667 109.3941 117.6778 118.2590 137.3705 157.3028 169.7889 173.6393 185.0152 198.3428 206.6097 217.0713 225.6710 244.5570 253.9843 264.3821 295.6235 306.9249 311.2157 328.8330 344.1400 350.2898 374.7482 403.4773 406.7896 415.6339 443.2046 476.0751 495.2723 513.2229 514.8667 528.0866 534.0775 564.8372 587.6794 597.7553 624.3996 642.2281 643.2221 656.2094 667.9769 677.3721 710.9400 729.6554 757.8334 759.1077 773.4078 774.4595 781.7313 799.1938 818.4600 834.5018 838.0730 851.7076 863.8105 870.7110 883.5816 895.7338 902.7251 915.6886 922.1177 941.2592 955.2680 960.2718 962.6415 974.3204 987.2830 987.3572 996.3562 1000.5031 1018.4902 1022.6629 1039.5446 1051.1506 1078.0550 1094.3078 1104.3262 1114.8420 1121.0253 1137.2554 1140.3594 1159.9000 1169.2603 1169.9624 1171.7128 1175.9316 1180.4827 1187.5383 1207.9136 1208.8079 1236.5521 1239.7188 1242.8622 1248.6786 1253.3850 1277.4076 1289.0342 1290.4537 1294.7887 1307.2420 1315.9354 1320.1998 1326.4661 1332.0829 1335.9456 1345.1129 1346.7812 1353.0915 1395.2707 1396.4181 1402.7685 1407.5123 1419.1666 1436.2062 1450.0346 1462.3507 1464.0002 1469.9913 1474.4083 1476.8843 1477.6143 1484.5526 1489.3408 1496.4822 1502.5810 1521.8462 1533.6977 1549.4373 1585.4409 1606.8219 1608.0689 1626.1342 1630.2264 1643.1339 2869.1251 2932.8970 2950.9646 2969.5360 2970.1496 2974.8376 2983.4358 3010.9011 3013.3904 3024.9792 3026.5382 3027.6864 3040.6808 3062.0852 3076.2537 3079.9606 3083.8496 3095.7175 3103.2785 3110.9830 3118.6092 3124.1287 3131.9071 3141.8111 3161.5880 3194.5053 3343.2609 3480.6874 3515.4630 3639.6855
redmass: 4.9215 4.7479 4.4914 3.6171 4.8726 3.7489 6.3497 4.9779 3.1636 3.2821 4.7824 2.2970 4.0020 3.0467 4.2064 4.0177 3.0369 4.4987 3.7270 1.7961 1.6161 1.4461 2.2369 1.3764 3.0685 3.2392 4.9542 3.3017 3.9724 4.7361 3.9033 5.3675 3.3934 3.4205 3.9790 3.1234 3.5034 2.4438 4.7658 5.8770 4.8982 1.7504 3.2036 2.3687 2.2958 3.7220 6.2947 1.5628 3.0303 3.8259 2.2598 3.9954 5.1006 3.9119 1.3807 4.3480 1.2676 2.1874 2.3508 2.1992 2.0264 5.6517 1.2646 2.8770 2.1492 1.5764 3.0160 2.1223 1.9316 2.5829 2.6409 4.4406 1.3493 1.3916 2.8068 3.1346 1.9716 1.3345 2.1072 1.3402 1.6235 2.2101 2.9405 2.2602 1.5048 2.0253 2.3034 1.4179 1.9594 2.9033 2.1181 1.2384 1.8456 1.5449 1.2583 1.6569 2.1992 1.9417 1.5039 1.1902 1.7933 1.2460 1.6639 1.2588 1.2606 1.8034 1.5628 1.4606 1.9854 1.3457 1.3827 1.4062 1.4399 1.4577 1.6331 1.7955 1.6831 1.5750 1.2100 1.2105 3.2257 3.8877 3.8815 4.7351 1.0955 1.0745 2.2329 1.0960 1.0566 1.1201 1.0692 1.0830 1.0899 2.5660 1.0660 1.8658 2.8856 3.3146 6.5667 3.9358 5.4313 2.1357 2.3249 6.5247 1.0713 1.0852 1.0818 1.0379 1.0622 1.0601 1.0369 1.0830 1.0736 1.1002 1.0695 1.0772 1.0915 1.0980 1.0995 1.1001 1.0996 1.1032 1.0913 1.1021 1.0858 1.0890 1.0906 1.0947 1.1003 1.0949 1.0815 1.0477 1.0759 1.0971
irintensity: 0.4234 0.6189 1.2268 0.4052 1.3884 1.7548 0.8449 9.1851 1.7036 3.2490 9.2698 0.3593 1.8840 3.2404 7.4613 10.6364 2.8784 0.6532 1.7734 1.5897 5.6224 51.0828 9.0500 1.4592 5.0326 0.5705 5.8764 25.7029 0.3012 8.2690 32.3331 16.3112 9.6831 1.5926 16.0793 1.3651 5.3117 23.1648 6.4355 2.9178 10.4789 99.5722 3.5247 37.9393 114.1025 7.4677 3.0150 53.1127 28.3004 1.2342 22.4851 5.7407 3.8962 15.3640 37.3921 1.9977 121.8082 18.8304 3.8325 115.0964 18.2607 7.8279 7.8688 1.6517 4.7399 97.2235 2.9598 4.6348 9.8694 9.2281 3.2812 3.3970 9.2445 10.5353 4.6966 7.2942 0.9667 0.0143 3.4066 0.3043 16.9971 11.7486 0.0856 4.1099 7.0033 4.6376 3.6147 19.5530 19.4834 10.0920 40.4598 2.7283 1.0598 11.4859 0.8594 20.3185 7.2653 10.5751 29.0035 7.9896 15.2063 1.2883 17.5241 20.5679 6.4853 7.6337 13.3596 7.0607 89.9651 6.3041 20.2570 27.1659 5.8680 2.6199 23.8614 77.9551 62.8983 79.8366 6.2836 42.0991 85.0513 91.7673 62.4145 33.3516 23.5782 4.1042 6.1517 40.7780 0.9672 5.9180 10.2483 41.9557 2.8093 576.2575 2.6209 362.2228 29.0140 154.9724 26.8951 293.3602 93.4880 22.4628 80.4193 48.2019 74.7720 55.5061 32.1020 47.7132 44.1025 31.6946 27.3716 43.4520 10.4103 33.4605 19.4185 28.5769 25.7726 54.1038 22.6040 36.8682 32.1644 28.1044 18.3593 13.3843 6.0407 0.0852 9.5709 34.9619 41.6497 11.6894 184.3211 21.2250 9.1396 20.3391
temp: 298.150 k
press: 1.00000 atm
elementType: 8 8 8 7 7 7 7 6 6 6 6 6 6 6 6 6 6 6 6 6 6 6 6 6 6 6 6 6 6 6 1 1 1 1 1 1 1 1 1 1 1 1 1 1 1 1 1 1 1 1 1 1 1 1 1 1 1 1 1 1
symmnumber: 1
zpe: 1307644.7 jmol-1
zpe.correction: 0.498056 hartree
zpe.thermalcorrener: 0.527086 hartree
zpe.thermalcorrenthalpy: 0.528030 hartree
zpe.thermalcorrgfe: 0.435901 hartree
zpe.sumelectzpe: -1336.956526 hartree
zpe.sumelectthermal: -1336.927495 hartree
zpe.sumelectthermalent: -1336.926551 hartree
zpe.sumelectthermalfe: -1337.018680 hartree
dipole: 3.0340 -1.5815 0.5140
dipole: 3.4598
quadrupole: -129.3672 -180.5421 -179.7056
quadrupole: 4.6760 -8.3040 -6.3129
quadrupole: 33.8378 -17.3372 -16.5006 4.6760 -8.3040 -6.3129
hfenergy: -1337.4545812 hartree
pointgroup: C01 [X(C23H30N4O3)]
dipole: 1.1680029 -0.27973 0.6406215 debye
polarizability: 442.0762591|-23.8361332|207.3378101|-3.210626|-22.416791|261.4023339 unknown
InChI: InChI=1S/C23H30N4O3/c1-3-15(2)21(26-22(29)19-9-6-12-27(19)20(28)14-24)23(30)25-18-11-10-16-7-4-5-8-17(16)13-18/h4-5,7-8,10-11,13,15,19,21,25-26H,3,6,9,12,14,24H2,1-2H3
charge 0 multiplicity 1
60 atoms
O  2.212247 -2.07206 1.390819
O  3.632478 0.426675 -2.146413
O  -0.48636 0.300901 -1.699661
N  4.722195 -1.036964 -0.713917
N  1.735212 -0.442209 -0.215921
N  -1.830414 0.250054 0.233633
N  5.668516 2.195762 -2.250206
C  3.57746 -2.002333 -0.682294
C  4.23029 -3.306879 -0.182223
C  5.372837 -2.812796 0.742695
C  5.906567 -1.544839 0.03408
C  2.445337 -1.510977 0.270548
C  0.606505 0.143864 0.507832
C  0.932862 1.562323 1.109164
C  4.684901 0.090914 -1.495119
C  2.008359 1.473643 2.225157
C  1.35126 2.571238 0.013639
C  -0.611121 0.227036 -0.442366
C  5.961592 0.943564 -1.566867
C  1.59023 0.661485 3.470951
C  -3.14896 0.399984 -0.285053
C  -4.218162 0.39107 0.62479
C  -3.403158 0.556984 -1.691982
C  -5.568139 0.536954 0.179835
C  -5.828722 0.697405 -1.237081
C  -4.714914 0.701428 -2.139181
C  -6.677477 0.53045 1.091267
C  -7.181663 0.84433 -1.686385
C  -7.985382 0.675902 0.62363
C  -8.241916 0.834464 -0.776653
H  3.161606 -2.080685 -1.703948
H  3.503151 -3.928565 0.36177
H  4.633291 -3.877241 -1.038815
H  6.165682 -3.565345 0.886653
H  4.950606 -2.552636 1.728092
H  6.726677 -1.788687 -0.671176
H  6.280636 -0.788769 0.748089
H  0.381453 -0.546658 1.34357
H  -0.007823 1.927207 1.577773
H  2.004738 -0.053636 -1.136304
H  2.935853 1.046073 1.794786
H  2.256317 2.510928 2.52749
H  2.309814 2.280039 -0.453634
H  0.598229 2.6488 -0.790357
H  1.485372 3.575019 0.456281
H  6.745098 0.322817 -2.069432
H  6.326888 1.11228 -0.529937
H  0.629223 1.027331 3.883234
H  2.349086 0.754982 4.269534
H  1.493662 -0.413737 3.237799
H  -1.774148 0.13891 1.249607
H  4.768291 2.184376 -2.739513
H  6.439063 2.638235 -2.748017
H  -4.027812 0.270287 1.700103
H  -2.559109 0.555258 -2.383373
H  -4.905684 0.820443 -3.212412
H  -6.484337 0.408821 2.164107
H  -7.372795 0.965024 -2.759479
H  -8.824463 0.66917 1.328197
H  -9.273124 0.947482 -1.128503
