program: Gaussian 09
title: 000128635
version: EM64L-G09RevD.01
frameworkgroup: C1[X(C18H18N4S)]
method: RPBEPBE
basis: SDD
operation: Freq
keyword: #p
keyword: freq=noraman
keyword: PBEPBE/SDD
title: #p freq=noraman PBEPBE/SDD
converged: NO YES NO NO
title: Mulliken charges:
elementType: S N N N N C C C C C C C C C C C C C C C C C C H H H H H H H H H H H H H H H H H H
charge: 0.242133 -0.163578 -0.110408 -0.134152 0.000827 -0.403560 -0.376783 -0.386924 -0.389097 -0.398057 0.483456 -0.351917 -0.363011 -0.307391 -0.363459 0.151876 0.170679 -0.328419 0.330463 -0.351156 -0.349559 -0.297871 -0.455680 0.194004 0.226492 0.210514 0.203072 0.205302 0.210115 0.221003 0.211139 0.207698 0.225637 0.219795 0.229886 0.273248 0.246512 0.291429 0.252918 0.256777 0.266047
chargesum: 0.00000
title: Mulliken charges with hydrogens summed into heavy atoms:
elementType: S N N N N C C C C C C C C C C C C C C C C C C
charge: 0.242133 -0.163578 -0.110408 -0.134152 0.000827 0.016935 0.036803 0.028493 0.043046 0.035278 0.483456 -0.132122 -0.133126 -0.034143 -0.116947 0.151876 0.170679 -0.328419 0.330463 -0.059727 -0.096640 -0.041095 -0.189633
polarizability: 7.06722574e+02 -7.22390286e+00 2.30275987e+02 -7.34502250e+00 4.98348920e+00 1.13304055e+02
1716.lowfreq: -20.0257 -6.2782 -3.4897 -0.0022 -0.0018 -0.0015 9.1543 14.5933 34.9237
frequency: 3.7692 8.5688 34.9134 43.2838 66.2094 78.3287 120.2066 146.5070 183.0524 188.5226 206.9876 209.7536 247.8171 265.7820 324.1948 337.5423 348.7357 362.5489 389.3837 422.3281 431.3704 441.0365 444.8498 462.7506 483.6911 512.1024 518.1586 531.9391 546.4851 589.7216 611.3076 627.5098 629.8162 680.8718 712.1673 735.3269 739.9569 745.0811 789.8174 797.2952 801.8959 806.7541 830.4961 838.3372 846.0502 848.4021 857.0208 913.8873 915.7656 918.6999 923.5582 947.3107 961.6943 975.9479 984.2269 986.5374 1011.5372 1016.6834 1057.0496 1085.4248 1107.7158 1118.8470 1124.5172 1128.2094 1143.3772 1154.2582 1167.9429 1196.2499 1224.8173 1234.7648 1244.5111 1261.3956 1263.7421 1270.9482 1274.6029 1305.1378 1329.6349 1333.7467 1340.2042 1348.6244 1354.0799 1364.0679 1368.9846 1375.3000 1391.0104 1420.8927 1427.1608 1453.9722 1456.4404 1461.9887 1463.8760 1466.0525 1468.8436 1480.6114 1503.1140 1548.1161 1558.5589 1595.2532 1619.7265 2908.9338 2912.2478 2971.4800 2989.1476 2990.1648 3041.9807 3049.7145 3058.4117 3074.9326 3103.2228 3145.4833 3146.1581 3156.6179 3167.4350 3170.5671 3172.1433 3178.7681 3216.9909
redmass: 4.3357 3.9422 5.6070 5.9236 3.4506 5.6471 5.9042 5.0124 5.0645 5.9498 3.1951 4.1624 2.5882 3.8111 5.6361 5.6737 4.5628 2.2464 3.6363 3.2205 3.4211 3.1268 3.5822 3.3305 7.3396 4.4318 3.0048 3.4659 4.7220 5.0941 4.8780 3.4331 6.9997 5.3532 5.6079 3.4967 6.0226 3.2106 1.4724 2.1863 1.9610 1.6484 1.8177 2.3536 1.5341 1.4993 5.8686 2.4569 1.5102 3.0173 5.8908 1.3260 1.3584 1.3534 1.3999 2.4989 2.6242 2.5308 1.9840 1.4652 1.4189 1.4912 2.3447 2.2425 2.2849 1.2662 1.3858 2.0322 1.9896 1.6013 1.4336 1.9110 1.3041 1.9740 1.1711 1.4020 4.4990 1.3646 1.4893 1.5615 1.5285 2.3918 1.6194 4.2843 2.2929 4.6326 3.9837 1.1483 3.3349 1.0864 9.8327 1.1324 1.0943 1.1202 2.9382 6.3438 7.2438 7.4560 6.4226 1.0719 1.0713 1.0643 1.0610 1.0611 1.0961 1.1025 1.1031 1.0914 1.0886 1.0871 1.0870 1.0881 1.0952 1.0919 1.0955 1.0975 1.0961
irintensity: 0.2929 0.6530 0.2622 2.1223 2.4504 0.3988 0.0618 0.3375 0.0924 1.0540 1.0963 1.4194 14.9285 1.1939 1.3866 7.2183 4.6180 7.3330 2.6170 3.2148 8.5403 3.8018 2.0534 21.5831 11.9124 4.2655 33.9497 19.3408 6.8618 6.0271 16.4141 13.3112 6.4886 0.6063 4.9470 4.6899 22.4129 1.1364 19.6428 12.8460 2.6129 4.0557 47.2975 6.8341 42.6614 68.6924 19.2571 9.0143 27.8061 70.5775 4.6136 4.5952 4.1128 0.0336 3.1054 1.7028 9.6745 32.2215 7.9953 3.4241 11.7212 3.9467 34.0869 129.1190 59.6337 10.8970 159.4768 15.1153 20.5799 92.5168 376.2175 5.7958 40.1684 0.3193 12.0516 25.6303 443.4463 17.6982 15.0955 12.1324 8.3667 21.8932 11.3715 7.6009 168.5826 21.9012 46.1321 8.6006 15.8708 13.7296 37.2117 60.7428 5.9983 18.4656 120.3165 52.6830 1.2317 40.3795 629.6288 26.9889 206.3978 50.1021 38.0242 35.1788 100.5884 31.9116 80.5155 22.5322 13.3585 18.4917 1.6951 2.2891 17.0483 0.8654 28.2994 11.5757 1.1412
temp: 298.150 k
press: 1.00000 atm
elementType: 16 7 7 7 7 6 6 6 6 6 6 6 6 6 6 6 6 6 6 6 6 6 6 1 1 1 1 1 1 1 1 1 1 1 1 1 1 1 1 1 1
symmnumber: 1
zpe: 851458.0 jmol-1
zpe.correction: 0.324303 hartree
zpe.thermalcorrener: 0.343807 hartree
zpe.thermalcorrenthalpy: 0.344751 hartree
zpe.thermalcorrgfe: 0.271569 hartree
zpe.sumelectzpe: -1312.111523 hartree
zpe.sumelectthermal: -1312.092019 hartree
zpe.sumelectthermalent: -1312.091075 hartree
zpe.sumelectthermalfe: -1312.164257 hartree
dipole: 7.9348 -0.8516 -0.4518
dipole: 7.9931
quadrupole: -110.5595 -132.0596 -147.1055
quadrupole: 5.5617 -1.4941 0.1749
quadrupole: 19.3487 -2.1514 -17.1973 5.5617 -1.4941 0.1749
hfenergy: -1312.4358258 hartree
pointgroup: C01 [X(C18H18N4S1)]
dipole: 3.1221028 -0.2729479 -0.2594954 debye
polarizability: 706.6780907|-2.9108445|222.6442358|-11.3967031|29.2082911|120.9802895 unknown
InChI: InChI=1S/C18H18N4S/c1-2-10-22(11-3-1)16-7-4-14(5-8-16)20-21-15-6-9-17-18(12-15)23-13-19-17/h4-9,12-13H,1-3,10-11H2
charge 0 multiplicity 1
41 atoms
S  -6.219603 -1.886025 -0.562931
N  4.788136 -0.182499 -0.248733
N  -0.900136 -0.342899 -0.117702
N  -1.551674 0.759641 0.190639
N  -7.206737 0.511757 0.182091
C  7.722138 -0.082651 0.00845
C  6.851993 1.182175 0.177883
C  6.908334 -1.332026 0.407676
C  5.54171 1.040001 -0.623583
C  5.576127 -1.429097 -0.373754
C  3.385891 -0.202243 -0.223993
C  2.636389 0.977549 0.121687
C  2.640376 -1.393498 -0.50953
C  1.241743 0.96856 0.170816
C  1.239331 -1.396138 -0.457259
C  0.509102 -0.222816 -0.123953
C  -2.97477 0.625456 0.176877
C  -5.066232 -0.540327 -0.157055
C  -5.802575 0.640419 0.211454
C  -3.667025 -0.567272 -0.179155
C  -3.696541 1.803032 0.544006
C  -5.098898 1.817843 0.56509
C  -7.575365 -0.694047 -0.186468
H  8.044199 -0.169076 -1.050053
H  8.640576 -0.010597 0.619773
H  6.613083 1.332342 1.248477
H  7.393447 2.080794 -0.17409
H  7.490981 -2.255085 0.225441
H  6.681019 -1.291712 1.490637
H  4.90803 1.92755 -0.485969
H  5.790084 0.985208 -1.709395
H  5.786528 -1.647735 -1.446607
H  4.989572 -2.268731 0.031786
H  3.16212 1.898098 0.392298
H  3.152795 -2.310306 -0.812155
H  0.682849 1.867658 0.448467
H  0.673902 -2.303985 -0.693743
H  -3.083566 -1.449311 -0.455813
H  -3.114838 2.691791 0.807065
H  -5.662498 2.712386 0.844513
H  -8.609496 -1.026581 -0.280884
