program: Gaussian 09
title: 000128629
version: EM64L-G09RevD.01
frameworkgroup: C1[X(C19H26O4)]
method: RPBEPBE
basis: SDD
operation: Freq
keyword: #pfreq=noraman
keyword: PBEPBE/SDD
title: #p freq=noraman PBEPBE/SDD
converged: YES YES NO NO
title: Mulliken charges:
elementType: O O O O C C C C C C C C C C C C C C C C C C C H H H H H H H H H H H H H H H H H H H H H H H H H H
charge: -0.300705 -0.246809 -0.423088 -0.239910 -0.085599 -0.182935 -0.396394 0.339086 -0.478785 0.407494 -0.700437 -0.716737 -0.185705 -0.415157 -0.395815 -0.197493 -0.475686 -0.236032 -0.230897 -0.241739 -0.384408 -0.476723 0.201162 0.210044 0.206517 0.188113 0.256327 0.228432 0.233835 0.233723 0.234692 0.215196 0.240325 0.216088 0.218696 0.221574 0.226239 0.274579 0.231208 0.206211 0.230752 0.223854 0.224272 0.205099 0.227214 0.226812 0.264526 0.247431 0.371552
chargesum: 0.00000
title: Mulliken charges with hydrogens summed into heavy atoms:
elementType: O O O O C C C C C C C C C C C C C C C C C C C
charge: -0.300705 -0.246809 -0.051536 -0.239910 0.124445 0.023581 0.048046 0.339086 -0.016517 0.407494 -0.016827 -0.041628 0.035869 -0.188919 -0.121236 0.033715 -0.038723 -0.012178 -0.006625 -0.014926 0.047906 0.035235 0.201162
polarizability: 2.36599095e+02 -1.98145137e+01 2.09906155e+02 2.07866013e+00 -9.42283110e+00 1.93610758e+02
1716.lowfreq: -3.3345 -0.0005 0.0003 0.0004 3.7962 6.7223 17.1711 21.7650 27.3848
frequency: 16.4199 21.7341 26.9127 31.4867 33.7003 48.9672 65.7092 88.3604 90.9550 111.6542 139.2781 152.8766 160.1172 192.6156 203.0560 214.3692 217.1488 243.9312 264.4886 277.7922 307.3274 318.6322 349.2635 362.9909 400.6853 402.8424 412.7031 420.2970 466.2225 479.5370 487.0670 498.3283 507.0439 524.3524 553.9261 592.2147 617.1197 637.1045 655.3065 704.5822 709.0699 721.5506 740.4708 764.0514 780.8733 784.2215 831.6328 834.7977 855.6488 856.0988 871.0142 902.7884 911.8849 921.1272 923.6088 930.1053 949.0666 957.4342 976.8984 979.1760 989.8086 992.1772 999.1505 1002.0944 1014.8906 1028.8465 1035.8524 1054.0663 1080.6263 1087.3987 1094.5387 1108.9013 1120.6251 1145.7232 1156.4826 1171.4863 1173.7845 1183.8432 1188.1640 1201.6817 1207.2706 1222.3694 1234.1514 1252.6933 1257.2893 1263.2455 1267.5364 1287.3587 1294.1876 1308.7415 1313.1242 1335.1891 1339.0020 1347.7859 1352.5363 1358.3299 1367.9904 1376.8493 1386.2794 1389.9856 1436.3876 1437.5026 1449.5853 1455.0609 1457.0481 1457.6848 1463.1445 1468.5936 1474.3642 1483.8238 1484.2755 1593.5991 1615.9142 1666.5437 1682.6527 2921.9407 2954.7446 2969.1983 2976.7102 2981.8110 2987.7660 3000.3558 3000.5426 3009.2900 3035.3277 3044.9380 3053.8816 3062.3035 3069.9689 3073.5298 3088.0639 3095.9994 3103.9621 3108.8458 3115.8041 3118.7189 3125.9022 3139.5175 3158.0193 3174.8356 3504.4059
redmass: 5.8991 6.8605 5.7238 4.5277 5.3564 4.2687 4.2047 3.4244 3.4057 3.6390 1.1784 2.0757 3.2954 2.2874 2.3346 1.6319 2.7108 2.4222 4.4610 3.6353 2.8254 2.5965 2.6632 2.9575 2.7978 2.8543 2.3067 2.8669 3.7470 3.7151 2.5538 3.3717 2.1455 3.5220 4.0615 3.1517 6.4067 4.5303 1.3685 2.0923 3.9546 2.5741 1.7811 2.2037 3.7488 2.3385 2.4109 2.6249 2.6036 1.3616 2.2832 2.2285 3.9912 1.6840 1.6033 1.8181 2.4219 1.9567 1.1341 1.3662 6.2487 1.3186 1.3210 2.2203 3.0220 2.0809 2.6040 2.2913 1.7076 2.0652 2.2627 1.9716 2.5969 1.7461 1.5828 1.0549 1.1769 1.1491 2.3281 1.3630 1.9375 1.2316 1.4897 1.5730 1.2617 1.8362 1.4813 1.3251 1.2965 1.4322 1.5294 1.4492 1.4588 1.4279 1.4236 1.2976 1.6277 1.3445 5.6934 1.2524 1.0988 2.1577 1.0588 1.0934 1.0543 1.0854 1.0678 1.0937 1.0641 1.0589 2.3439 6.2385 6.1385 7.9881 6.6079 1.0818 1.0699 1.0630 1.0811 1.0633 1.0629 1.0624 1.0377 1.0352 1.0957 1.0907 1.0995 1.0976 1.0903 1.0952 1.0942 1.0988 1.1006 1.0876 1.1002 1.1004 1.0866 1.0929 1.0983 1.0961 1.0638
irintensity: 0.0780 0.2914 0.5257 0.2358 0.7877 0.1265 0.2887 0.5393 1.3130 0.3996 0.1393 0.3594 1.3068 1.3817 2.0824 0.2197 1.0147 2.4149 0.1739 4.6523 4.1415 5.2917 5.5657 0.2327 4.6172 0.6878 1.1424 8.3556 4.0451 6.2918 1.7886 13.7730 35.2219 6.3212 3.2683 12.8622 0.0345 2.8701 141.1261 26.8297 20.5120 43.0636 13.5730 14.5487 57.9013 11.5959 8.1403 2.3199 2.5599 0.4154 8.8646 13.2197 36.6017 5.0335 3.3531 8.6902 2.5932 20.6879 24.4785 0.9035 0.0213 0.9324 2.3520 35.6491 105.1334 9.2233 171.1104 12.0190 19.0230 15.8985 21.3408 20.9062 33.0250 54.9203 20.7111 0.2561 4.2532 13.4879 130.7215 7.9334 7.3976 11.1055 14.1711 2.8822 3.1761 24.3263 8.2292 2.7373 1.4039 4.4747 8.5935 6.4659 3.3563 3.9856 3.8605 8.6566 22.8170 44.1449 1.6293 37.6412 26.5348 12.3552 2.6494 5.7645 2.3600 14.0974 11.9749 16.8065 12.2093 5.4888 18.9185 1.4780 8.2421 200.2932 1.2820 33.2831 39.1405 31.6667 51.8861 11.6590 24.0593 37.9537 16.4101 12.0130 16.8598 5.1851 9.1588 2.7550 38.3644 49.7608 22.1198 28.4684 5.4813 11.0885 29.0568 24.4937 0.9027 31.3455 33.7997 7.3245 16.8408
temp: 298.150 k
press: 1.00000 atm
elementType: 8 8 8 8 6 6 6 6 6 6 6 6 6 6 6 6 6 6 6 6 6 6 6 1 1 1 1 1 1 1 1 1 1 1 1 1 1 1 1 1 1 1 1 1 1 1 1 1 1
symmnumber: 1
zpe: 1076610.7 jmol-1
zpe.correction: 0.410059 hartree
zpe.thermalcorrener: 0.433850 hartree
zpe.thermalcorrenthalpy: 0.434794 hartree
zpe.thermalcorrgfe: 0.353497 hartree
zpe.sumelectzpe: -1038.743097 hartree
zpe.sumelectthermal: -1038.719307 hartree
zpe.sumelectthermalent: -1038.718363 hartree
zpe.sumelectthermalfe: -1038.799660 hartree
dipole: 0.5106 0.9948 1.3352
dipole: 1.7416
quadrupole: -145.2621 -137.5927 -125.8374
quadrupole: -9.7216 2.7882 -0.6177
quadrupole: -9.0313 -1.3620 10.3933 -9.7216 2.7882 -0.6177
hfenergy: -1039.1531566 hartree
pointgroup: C01 [X(C19H26O4)]
dipole: -0.2035937 0.3870613 -0.5274721 debye
polarizability: 237.7648546|19.3029755|209.1555315|0.8314324|8.5731928|193.1956217 unknown
InChI: InChI=1S/C19H26O4/c1-19(2)22-14-16(12-6-3-4-9-13-17(20)21)18(23-19)15-10-7-5-8-11-15/h3,5-8,10-11,16,18,20H,4,9,12-14H2,1-2H3
charge 0 multiplicity 1
49 atoms
O  -2.049529 1.683407 0.383355
O  0.28015 2.337891 0.110517
O  4.131264 0.216203 -2.183392
O  5.356398 -1.575055 -1.365645
C  -0.442567 0.060168 -0.581952
C  -1.909787 0.596632 -0.60816
C  0.485733 1.259918 -0.879568
C  -1.114139 2.816975 0.18101
C  -0.080535 -0.643225 0.756521
C  -2.965377 -0.457986 -0.310205
C  -1.493072 3.630907 -1.07523
C  -1.19756 3.638808 1.465086
C  1.286273 -1.291838 0.719002
C  -3.252521 -1.439644 -1.292194
C  -3.655232 -0.496252 0.925327
C  2.307555 -1.026974 1.576222
C  3.676138 -1.675258 1.527873
C  -4.20548 -2.451103 -1.041279
C  -4.613327 -1.5055 1.175089
C  -4.889693 -2.487913 0.196661
C  4.834896 -0.645711 1.39571
C  4.70935 0.27248 0.160677
C  4.786381 -0.48251 -1.151158
H  -0.335945 -0.67061 -1.412059
H  -2.098793 1.002526 -1.628109
H  0.314721 1.639223 -1.909814
H  1.547645 0.985359 -0.78094
H  -0.852008 -1.412802 0.96001
H  -0.13202 0.095109 1.576743
H  -0.824126 4.504234 -1.159487
H  -2.534622 3.983397 -0.985453
H  -1.40744 3.045984 -2.006606
H  -0.931031 3.001716 2.323647
H  -2.221527 4.022915 1.605677
H  -0.493042 4.485529 1.416211
H  1.445643 -2.043567 -0.073458
H  -2.734784 -1.411144 -2.259992
H  -3.440392 0.273995 1.671132
H  2.151114 -0.274533 2.367083
H  3.849455 -2.257663 2.456278
H  3.726058 -2.394666 0.688928
H  -4.419273 -3.202889 -1.809564
H  -5.144419 -1.524277 2.133724
H  4.861371 -0.003042 2.297344
H  5.795057 -1.192649 1.352435
H  -5.632536 -3.269421 0.392507
H  3.769097 0.849596 0.182449
H  5.533385 1.014655 0.154709
H  4.242293 -0.289195 -3.034961
