program: Gaussian 09
title: 000128597
version: EM64L-G09RevD.01
frameworkgroup: C1[X(C8H16N2O4)]
method: RPBEPBE
basis: SDD
operation: Freq
keyword: #p
keyword: freq=noraman
keyword: PBEPBE/SDD
title: #p freq=noraman PBEPBE/SDD
converged: YES YES NO NO
title: Mulliken charges:
elementType: O O O O N N C C C C C C C C H H H H H H H H H H H H H H H H
charge: -0.414107 -0.428761 -0.233711 -0.217251 -0.319029 -0.564699 -0.426554 -0.339686 -0.359702 -0.228090 -0.102206 -0.726770 0.141915 0.185630 0.243334 0.185133 0.220168 0.216525 0.175379 0.236269 0.258521 0.258382 0.221135 0.249595 0.215275 0.238919 0.283127 0.276857 0.378028 0.376374
chargesum: 0.00000
title: Mulliken charges with hydrogens summed into heavy atoms:
elementType: O O O O N N C C C C C C C C
charge: -0.036080 -0.052388 -0.233711 -0.217251 -0.060647 -0.004715 0.001914 0.097008 0.051945 0.030431 0.118929 -0.022981 0.141915 0.185630
polarizability: 1.30998833e+02 1.11183917e+00 1.12653191e+02 2.93896191e+00 -2.93840060e+00 9.58228618e+01
1716.lowfreq: -0.0003 0.0008 0.0009 2.1435 3.7730 10.7615 20.6308 30.5394 39.4493
frequency: 20.4997 30.5138 39.4376 43.3911 69.1603 81.8755 102.4058 124.9528 159.8446 186.1358 212.7335 222.6424 248.3909 265.7395 297.8860 312.6627 345.4587 397.7018 439.7030 497.6040 505.5352 525.1781 575.3703 584.4487 620.3372 631.9406 689.3233 692.2544 727.3794 746.0031 769.8400 784.3708 873.1835 917.6726 954.3994 1010.6195 1022.7272 1029.3347 1032.4915 1057.1205 1086.9971 1100.1415 1123.0535 1151.2841 1176.6994 1197.9999 1206.1286 1229.2884 1250.4615 1267.1254 1277.1351 1287.0149 1294.7529 1306.8691 1348.3766 1352.7368 1366.4604 1381.2844 1383.4223 1451.9072 1456.4335 1472.1881 1478.0619 1483.2113 1492.6528 1654.0393 1656.8755 1673.9905 2843.8568 2848.4406 2965.8515 2992.6413 2996.4205 3021.1914 3034.1169 3038.2312 3067.0023 3086.9938 3120.7928 3453.4833 3469.5121 3500.5333 3520.6926 3570.9758
redmass: 5.6486 5.4887 10.5594 8.0457 4.7951 3.5828 1.8708 4.7530 2.6548 1.1737 1.1857 3.4256 2.5038 3.4043 3.6850 3.1081 3.1673 3.7328 2.7739 2.6572 3.0385 1.9761 1.4649 2.4370 1.9914 1.9047 1.6574 3.8657 3.2933 1.4327 2.6901 2.0354 1.5294 2.2815 1.8633 2.6882 2.5646 2.8129 2.4115 2.2352 2.1582 1.8946 1.8133 1.8473 1.8936 1.6086 2.0813 1.4152 1.5921 1.5108 1.3932 1.3382 1.2374 1.2669 1.6300 1.4017 1.4145 1.4910 1.2006 1.0834 1.1860 1.0807 1.0666 1.1010 1.0874 3.3642 1.3628 8.6709 1.0757 1.0751 1.0624 1.0365 1.0596 1.0867 1.0845 1.0976 1.1039 1.0991 1.1001 1.0455 1.0749 1.0641 1.0641 1.0961
irintensity: 0.8002 2.1899 0.7310 0.8499 0.6276 0.3375 0.2631 1.6549 8.8107 58.8038 0.8111 1.9641 3.5661 7.5975 7.2729 2.6683 22.2571 14.2313 28.2644 48.3579 5.8776 65.8629 39.6456 58.0062 139.9565 64.1442 238.0079 30.4408 13.1014 21.9779 2.6719 4.8717 11.2143 4.1031 6.8394 142.3874 168.4469 162.0875 131.6101 1.8256 19.0288 5.3375 1.6966 15.9345 34.9779 7.5053 11.8001 4.9601 17.0573 1.9734 15.6978 2.2111 14.6868 3.2272 13.3743 2.3123 3.1483 0.5271 20.5113 5.2583 23.8704 3.0946 6.9563 16.8509 5.7655 90.6551 165.3247 205.5157 36.0339 139.5564 20.0131 25.7301 25.5006 9.7116 21.6898 14.6776 48.5226 25.9095 15.7279 0.8091 0.5266 13.0747 23.7829 2.5977
temp: 298.150 k
press: 1.00000 atm
elementType: 8 8 8 8 7 7 6 6 6 6 6 6 6 6 1 1 1 1 1 1 1 1 1 1 1 1 1 1 1 1
symmnumber: 1
zpe: 645897.3 jmol-1
zpe.correction: 0.246009 hartree
zpe.thermalcorrener: 0.262837 hartree
zpe.thermalcorrenthalpy: 0.263781 hartree
zpe.thermalcorrgfe: 0.198805 hartree
zpe.sumelectzpe: -723.715050 hartree
zpe.sumelectthermal: -723.698222 hartree
zpe.sumelectthermalent: -723.697278 hartree
zpe.sumelectthermalfe: -723.762254 hartree
dipole: -0.5938 -0.8904 -1.3152
dipole: 1.6956
quadrupole: -71.7957 -79.2347 -89.0077
quadrupole: 2.5917 -1.9866 -2.3774
quadrupole: 8.2170 0.7780 -8.9950 2.5917 -1.9866 -2.3774
hfenergy: -723.9610589 hartree
pointgroup: C01 [X(C8H16N2O4)]
dipole: -0.2260796 0.3842416 0.4962624 debye
polarizability: 130.904495|-1.3735022|112.1863168|-3.3774773|-4.0148677|96.3840732 unknown
InChI: InChI=1S/C8H16N2O4/c1-5(7(11)12)10-4-2-3-6(9)8(13)14/h5-6,10-11,13H,2-4,9H2,1H3
charge 0 multiplicity 1
30 atoms
O  3.624872 -1.971374 0.022819
O  -4.822724 -0.850234 0.697308
O  3.698582 -0.411044 -1.696954
O  -2.864345 -1.83091 -0.069673
N  -1.671177 0.762928 -0.370066
N  3.588962 1.739883 0.235246
C  0.758114 0.5584 0.088651
C  1.827516 0.206478 1.144661
C  -0.667963 0.390015 0.647164
C  3.29533 0.360304 0.642386
C  -3.080702 0.669924 0.013286
C  -3.971916 1.359263 -1.050534
C  3.563877 -0.663704 -0.47941
C  -3.513423 -0.79562 0.176945
H  0.858115 -0.08217 -0.808159
H  0.897841 1.609658 -0.240109
H  1.724148 0.878373 2.017051
H  1.681807 -0.833257 1.495006
H  -0.769547 0.99029 1.588319
H  -0.829236 -0.670606 0.915686
H  3.955405 0.093167 1.487988
H  -1.459685 1.65876 -0.825536
H  -3.299608 1.147064 1.003379
H  -5.036721 1.271734 -0.78386
H  -3.714454 2.432738 -1.114532
H  -3.804915 0.899911 -2.040244
H  3.160257 1.989433 -0.663262
H  4.590336 1.9593 0.229313
H  3.761513 -2.612112 -0.727549
H  -5.088659 -1.803692 0.800581
