program: Gaussian 09
title: 000128651
version: EM64L-G09RevD.01
frameworkgroup: C1[X(C16H22N6O3)]
method: RPBEPBE
basis: SDD
operation: Freq
keyword: #p
keyword: freq=noraman
keyword: PBEPBE/SDD
title: #p freq=noraman PBEPBE/SDD
converged: YES YES NO NO
title: Mulliken charges:
elementType: O O O N N N N N N C C C C C C C C C C C C C C C C H H H H H H H H H H H H H H H H H H H H H H
charge: -0.283673 -0.219568 -0.279611 -0.394916 -0.418977 -0.315871 -0.061751 -0.079678 -0.582146 -0.113088 -0.542101 0.415652 0.171366 0.137950 -0.448235 0.003216 0.084468 -0.446487 -0.323170 -0.272326 -0.334997 -0.237841 -0.395064 -0.181544 -0.507012 0.285594 0.231294 0.284637 0.377067 0.232637 0.229546 0.318408 0.262897 0.211598 0.198237 0.251146 0.280248 0.288407 0.253779 0.196001 0.204523 0.241015 0.236325 0.252623 0.246649 0.279026 0.263749
chargesum: 0.00000
title: Mulliken charges with hydrogens summed into heavy atoms:
elementType: O O O N N N N N N C C C C C C C C C C C C C C C C
charge: -0.283673 -0.219568 -0.279611 -0.017850 -0.100569 -0.064725 -0.061751 -0.079678 -0.039371 0.172506 -0.026169 0.415652 0.171366 0.137950 0.013947 0.003216 0.084468 -0.183591 0.086665 0.007922 -0.046590 0.015938 0.005461 0.059471 0.228585
polarizability: 2.70511774e+02 -3.48662833e+00 2.29521527e+02 -1.84705806e+01 1.29912626e+01 1.66440154e+02
1716.lowfreq: -3.9012 -0.0007 -0.0003 0.0003 4.5197 7.3035 11.9509 21.7756 28.1100
frequency: 11.3397 21.7329 28.0506 37.3017 42.7358 51.1083 54.3455 63.4750 72.2563 80.2797 98.3164 114.4161 117.2538 139.3449 143.7006 149.5336 174.1253 185.6029 196.8506 206.7459 225.2831 244.6930 256.5815 282.7581 291.7945 325.8348 357.5346 380.2496 431.4658 438.3690 485.2673 491.0279 531.7713 549.5884 575.7511 589.0543 614.3249 623.0273 647.4351 660.5816 679.8228 683.1511 699.6677 719.0210 733.6422 762.8886 765.7982 773.4252 790.7437 805.3040 831.4500 835.4769 854.3823 890.8973 900.3665 921.9533 925.4512 941.8361 959.6445 969.0780 980.6046 989.3730 1015.2238 1016.5453 1044.7848 1061.8539 1062.7899 1086.9753 1088.3704 1105.5693 1112.7635 1114.3302 1142.4136 1148.2465 1149.1387 1152.1752 1156.2545 1161.7258 1189.2777 1221.8794 1229.9133 1233.5323 1238.3376 1248.8357 1253.0779 1269.9080 1284.3316 1299.2607 1323.4224 1333.6518 1341.0594 1352.2979 1355.3824 1370.5805 1390.5623 1408.8301 1423.2336 1430.8157 1436.2344 1452.5487 1456.2574 1464.9598 1467.9576 1468.0931 1484.3082 1493.9325 1494.4606 1564.8879 1566.2367 1578.2589 1599.8257 1642.6387 1647.0994 2901.7894 2908.8435 2917.9789 2973.6519 2988.2396 2989.7910 3006.9522 3016.1934 3017.7677 3083.8051 3110.8936 3143.4510 3151.8073 3169.8829 3178.8386 3227.7468 3237.7468 3422.9830 3451.2458 3474.6198 3576.2865 3602.4591
redmass: 6.1593 5.4627 5.5230 3.3740 4.5367 6.5319 3.6711 3.7331 3.7786 3.3669 4.2535 1.1727 2.7509 3.8857 3.8568 2.7172 4.4580 1.8832 4.1967 2.1431 3.1783 5.7227 5.2797 5.7001 5.2541 6.3024 2.2092 3.2866 3.8492 5.1902 4.4424 4.8746 4.6952 5.0797 1.3747 4.8070 5.2566 3.8947 3.5425 3.9163 4.4766 1.2585 1.9460 1.7193 1.4518 2.4547 2.3845 1.6442 3.9233 1.1129 1.6429 1.8588 3.9659 5.3104 2.6606 4.3363 5.0016 1.5791 1.4435 6.5016 3.4846 2.4186 1.5586 2.3705 1.8976 1.6111 2.3735 2.1413 2.9300 2.1758 2.7605 1.2724 2.4140 1.6393 1.4119 2.0806 1.2431 1.7138 2.0422 1.7830 1.5969 1.9828 1.4722 1.2385 1.3512 2.3911 1.1270 1.5182 1.9919 2.4290 1.9168 1.6660 1.7819 4.0273 1.6617 2.2973 1.1854 3.0134 2.4205 1.0502 1.2202 1.0862 1.0964 1.0884 1.0817 1.7659 1.3659 5.0148 6.9179 6.4754 8.9301 1.0939 10.0464 1.0682 1.0678 1.0659 1.0808 1.0905 1.0901 1.0295 1.0629 1.0965 1.1007 1.1047 1.0887 1.1054 1.0930 1.0986 1.0974 1.1002 1.0740 1.0776 1.0451 1.0818 1.0981
irintensity: 0.9392 1.6469 0.7705 0.3141 5.1284 0.8986 0.2437 3.8888 1.9911 0.3030 5.7049 1.1370 3.7571 10.1037 5.7870 9.6457 1.2663 13.2448 4.5096 46.3757 3.1947 4.7565 0.9700 17.7759 26.8695 7.6400 2.6821 1.1362 0.5019 6.2677 22.7755 1.1439 13.3145 10.6175 228.0504 3.9732 20.5323 1.9707 43.9313 15.3637 18.3001 62.3061 36.8592 53.2596 102.2133 49.1437 6.7833 12.5058 43.2650 3.4460 17.0104 20.9240 4.9937 14.6729 6.8403 2.2180 14.7900 8.6846 0.4388 10.7612 5.2593 12.6150 17.0568 21.8706 5.8734 10.4832 1.8432 62.9700 13.7734 18.0987 28.5812 0.5886 254.7970 37.4118 3.7831 24.7138 6.0919 30.9554 39.3176 1.2405 12.7947 6.1923 2.2250 8.2796 3.4015 2.1832 3.8569 6.3738 35.7457 5.7315 23.8905 0.4734 32.7611 2.5793 2.3099 7.6308 17.4046 44.3234 119.9903 14.6530 28.7159 9.8741 24.9671 22.8963 5.0689 303.4680 108.7389 9.6396 39.9124 128.2961 83.0972 43.7570 121.4082 17.4498 28.0015 174.4572 20.6713 4.7538 16.5622 29.2760 23.9174 83.3639 4.3976 22.1624 11.0054 13.0408 1.4156 6.7400 6.9651 1.0904 0.6977 77.3739 0.3982 34.5629 0.9870
temp: 298.150 k
press: 1.00000 atm
elementType: 8 8 8 7 7 7 7 7 7 6 6 6 6 6 6 6 6 6 6 6 6 6 6 6 6 1 1 1 1 1 1 1 1 1 1 1 1 1 1 1 1 1 1 1 1 1 1
symmnumber: 1
zpe: 990465.6 jmol-1
zpe.correction: 0.377248 hartree
zpe.thermalcorrener: 0.402979 hartree
zpe.thermalcorrenthalpy: 0.403923 hartree
zpe.thermalcorrgfe: 0.316685 hartree
zpe.sumelectzpe: -1175.207282 hartree
zpe.sumelectthermal: -1175.181551 hartree
zpe.sumelectthermalent: -1175.180607 hartree
zpe.sumelectthermalfe: -1175.267845 hartree
dipole: -0.4449 -1.2061 -3.4213
dipole: 3.6549
quadrupole: -91.9383 -152.5400 -154.6594
quadrupole: -16.9122 -18.0294 10.6703
quadrupole: 41.1076 -19.4941 -21.6135 -16.9122 -18.0294 10.6703
hfenergy: -1175.5845303 hartree
pointgroup: C01 [X(C16H22N6O3)]
dipole: -0.0608412 0.1281711 1.4309128 debye
polarizability: 272.4353962|-3.9850443|219.5576839|14.0839058|25.541759|174.4803751 unknown
InChI: InChI=1S/C16H22N6O3/c1-25-16(24)14(7-12-9-19-10-20-12)22-15(23)13-4-2-3-11(21-13)8-18-6-5-17/h2-4,9-10,14,18,20,22H,5-8,17H2,1H3
charge 0 multiplicity 1
47 atoms
O  4.648386 -0.074217 1.532229
O  2.470929 0.440817 2.177134
O  1.321844 -3.089331 -1.034096
N  1.409563 -1.075524 0.143249
N  4.241508 1.693114 -1.102081
N  -4.443029 1.062106 0.361394
N  -1.260619 -0.800875 0.099723
N  2.8221 2.599459 -2.607283
N  -7.206776 3.349807 1.558153
C  2.860916 -1.099313 0.275975
C  3.605226 -0.777668 -1.071311
C  3.443593 0.629275 -1.564747
C  3.256789 -0.166629 1.419307
C  0.739772 -2.08692 -0.500665
C  -3.117063 0.624937 0.840485
C  -0.760062 -1.911794 -0.522725
C  -2.611674 -0.608271 0.103256
C  2.577831 1.21926 -2.492694
C  -5.117414 2.06416 1.217427
C  -1.571212 -2.868423 -1.170459
C  -3.498164 -1.521757 -0.525525
C  3.833311 2.852683 -1.753719
C  -6.532216 2.371771 0.685008
C  -2.968749 -2.662222 -1.168498
C  5.138194 0.715809 2.69356
H  3.172431 -2.129164 0.551015
H  4.672967 -1.0265 -0.92913
H  3.198397 -1.48492 -1.813326
H  0.846712 -0.328001 0.571613
H  -3.215518 0.37044 1.915907
H  -2.322705 1.40496 0.783055
H  4.98385 1.598654 -0.408855
H  1.802112 0.735585 -3.082291
H  -4.562154 3.026372 1.311317
H  -5.197593 1.637419 2.238364
H  -4.398343 1.378206 -0.618375
H  -1.095207 -3.728484 -1.649229
H  -4.570327 -1.310969 -0.488088
H  4.288217 3.825977 -1.585339
H  -6.446293 2.821728 -0.324274
H  -7.073141 1.404167 0.562939
H  -3.634748 -3.380296 -1.658674
H  6.233315 0.692208 2.606544
H  4.805774 0.245531 3.633495
H  4.748759 1.746832 2.649512
H  -7.98981 3.84802 1.128918
H  -7.43498 2.997581 2.492108
