program: Gaussian 09
title: 000128605
version: EM64L-G09RevD.01
frameworkgroup: C1[X(C16H24O5)]
method: RPBEPBE
basis: SDD
operation: Freq
keyword: #pfreq=noraman
keyword: PBEPBE/SDD
title: #p freq=noraman PBEPBE/SDD
converged: YES YES NO NO
title: Mulliken charges:
elementType: O O O O O C C C C C C C C C C C C C C C C H H H H H H H H H H H H H H H H H H H H H H H H
charge: -0.247454 -0.279075 -0.278691 -0.237246 -0.237030 0.055944 0.053843 -0.243673 -0.243560 -0.435033 -0.448085 -0.434576 -0.447653 -0.402284 -0.397473 -0.402256 -0.397078 -0.389149 -0.388815 0.296627 0.296166 0.231910 0.232935 0.285284 0.285580 0.203188 0.237672 0.221959 0.207141 0.203243 0.236782 0.221753 0.207458 0.208476 0.201483 0.198709 0.208989 0.208458 0.201558 0.198539 0.208927 0.205279 0.193071 0.205381 0.192777
chargesum: 0.00000
title: Mulliken charges with hydrogens summed into heavy atoms:
elementType: O O O O O C C C C C C C C C C C C C C C C
charge: -0.247454 -0.279075 -0.278691 -0.237246 -0.237030 0.287854 0.286778 0.041611 0.042020 0.005827 -0.018985 0.005449 -0.018442 0.007674 0.010224 0.007760 0.010388 0.009201 0.009343 0.296627 0.296166
polarizability: 2.42036778e+02 -9.33216790e-02 1.53275413e+02 2.39541816e+00 -8.62855191e-01 1.63657529e+02
1716.lowfreq: -0.0003 0.0007 0.0008 2.5730 7.6791 10.6703 20.2547 29.6237 40.2078
frequency: 17.8726 29.3278 40.1841 45.7705 68.8197 69.6556 72.2680 91.9528 115.5141 137.0243 146.4836 204.7291 212.5185 226.3180 228.1213 273.5277 312.8601 315.8574 330.7339 333.2741 391.4024 405.9487 417.0066 430.0432 438.2673 451.1698 452.7706 483.7156 518.9223 522.0329 621.0417 677.5303 685.7083 711.1840 774.3692 790.8448 791.1004 794.5019 797.0640 823.1503 825.4044 835.9828 860.8335 871.7520 887.8081 887.9725 897.2719 898.4944 924.0000 924.8028 946.6514 951.5554 998.1234 999.7037 1046.4229 1047.0496 1055.4412 1056.9627 1080.3966 1083.3181 1084.3379 1087.0412 1112.2677 1112.4971 1152.7302 1153.0680 1172.6526 1196.5882 1199.7287 1203.3946 1242.4088 1242.7639 1254.3433 1255.4351 1257.9975 1261.8492 1266.6496 1269.0896 1306.1456 1306.8853 1309.8149 1311.6172 1333.2802 1333.4935 1339.4841 1339.8296 1340.6739 1343.0068 1347.3874 1351.6922 1361.9660 1365.6448 1377.3809 1464.0307 1464.8776 1466.8731 1467.4938 1468.7409 1468.8280 1474.5360 1474.9130 1482.9219 1483.0659 1621.1389 1621.8221 2972.2434 2972.9676 2974.1000 2974.2452 2975.6169 2975.7440 2987.9403 2988.5483 2991.2721 2992.0183 3012.7924 3012.8612 3036.6348 3036.7580 3039.1866 3039.4996 3047.2924 3047.8278 3058.8781 3059.8749 3066.5166 3067.2703 3153.0447 3156.7955
redmass: 3.8291 4.5451 3.8149 4.7511 5.7661 5.7053 5.6727 4.9683 4.1117 3.7636 6.4888 3.2341 3.3837 2.0356 2.0384 5.3542 4.2986 4.7894 1.9123 1.9590 6.8110 5.7300 4.7228 2.9799 3.4129 2.6813 2.3522 2.5211 1.8397 3.0100 4.0561 11.1224 4.3426 7.6059 6.9180 1.5572 1.4508 2.3201 2.3884 4.3843 6.4209 2.8879 2.2017 2.5818 1.8691 1.8792 1.6175 1.6293 1.7372 1.7227 4.5912 5.4626 2.6822 2.6980 1.7458 1.7840 1.1363 1.1147 1.3414 1.2805 1.2806 1.1992 2.7029 2.6965 2.2959 2.2979 3.1433 2.3253 1.5257 2.4315 1.3105 1.3152 1.2982 1.3040 1.4733 1.3133 1.5049 1.1818 1.2252 1.2230 1.3094 1.3123 1.3523 1.3719 1.4564 1.5167 1.4849 1.4534 1.5632 1.5406 1.6483 1.4812 2.9228 1.0868 1.0859 1.0894 1.0903 1.0878 1.0897 1.0834 1.0838 1.0977 1.0977 10.9634 10.5976 1.0657 1.0663 1.0614 1.0625 1.0625 1.0628 1.0621 1.0623 1.0639 1.0640 1.0824 1.0829 1.0958 1.0958 1.0980 1.0980 1.1010 1.1010 1.1021 1.1020 1.1027 1.1028 1.0934 1.0876
irintensity: 0.9032 0.8475 0.5081 0.0352 0.4696 1.4928 0.1327 0.5009 0.4394 1.9747 1.2628 0.7283 14.9759 1.8846 1.8862 6.7395 3.7757 1.7184 1.1153 2.8351 6.2702 15.7955 0.1700 6.1272 0.3135 1.1744 0.9764 0.5229 0.5486 7.5374 3.4191 21.2110 0.3402 27.4132 4.9646 1.9799 1.3060 1.4406 7.4543 0.0034 20.5035 13.0984 0.0451 6.0958 5.9043 5.5319 9.4566 19.2467 6.2853 3.0847 1.2902 321.7264 157.7444 3.4334 0.6984 0.4142 0.5926 0.4258 46.7710 2.0284 2.6795 11.0130 0.5960 0.5846 1.0682 1.6510 2.1787 373.0484 14.9232 389.4613 1.7350 0.1058 2.5570 1.3288 4.0943 2.9844 0.4164 18.9555 6.9172 4.2038 0.6523 1.2469 0.3412 0.6975 0.4804 1.3928 1.9079 0.1510 1.0183 0.7548 0.0450 8.7312 3.6246 3.2150 1.2125 12.0125 13.6208 7.7612 7.9103 22.2001 20.3130 3.4354 2.7170 334.2959 47.9337 32.8758 28.9565 34.6635 35.0186 37.5611 30.1471 8.3281 8.7512 16.9943 16.3334 33.7313 6.4066 97.9934 21.2777 52.9601 62.0208 41.0071 42.9892 14.9525 15.9676 61.0113 66.4247 0.8888 4.3520
temp: 298.150 k
press: 1.00000 atm
elementType: 8 8 8 8 8 6 6 6 6 6 6 6 6 6 6 6 6 6 6 6 6 1 1 1 1 1 1 1 1 1 1 1 1 1 1 1 1 1 1 1 1 1 1 1 1
symmnumber: 1
zpe: 996027.8 jmol-1
zpe.correction: 0.379367 hartree
zpe.thermalcorrener: 0.400058 hartree
zpe.thermalcorrenthalpy: 0.401002 hartree
zpe.thermalcorrgfe: 0.327498 hartree
zpe.sumelectzpe: -998.555548 hartree
zpe.sumelectthermal: -998.534857 hartree
zpe.sumelectthermalent: -998.533912 hartree
zpe.sumelectthermalfe: -998.607417 hartree
dipole: 0.0051 1.4058 0.0853
dipole: 1.4084
quadrupole: -89.6805 -128.1259 -136.4918
quadrupole: -0.5371 7.6835 0.4552
quadrupole: 28.4189 -10.0265 -18.3924 -0.5371 7.6835 0.4552
hfenergy: -998.9349147 hartree
pointgroup: C01 [X(C16H24O5)]
dipole: -0.0009677 0.5535912 0.0239687 debye
polarizability: 241.7328022|0.2997374|153.2494663|5.4237714|-0.6627105|163.9874523 unknown
InChI: InChI=1S/C16H24O5/c17-15(19-11-7-3-1-4-8-11)13-14(21-13)16(18)20-12-9-5-2-6-10-12/h11-14H,1-10H2
charge 0 multiplicity 1
45 atoms
O  0.007638 -1.690158 -0.095676
O  2.526503 -0.211707 0.009009
O  -2.526162 -0.250594 -0.042886
O  2.015155 0.524543 -2.153794
O  -2.016655 0.304439 2.173915
C  3.989725 0.087422 -0.207774
C  -3.990418 0.027158 0.194333
C  0.249641 -0.350726 -0.738903
C  -0.24636 -0.428982 0.685497
C  4.256784 1.582724 0.037417
C  4.761946 -0.812306 0.76399
C  -4.25857 1.535559 0.052646
C  -4.757958 -0.805765 -0.838916
C  5.7764 1.869604 -0.072992
C  6.281994 -0.523844 0.65875
C  -5.778884 1.81486 0.1702
C  -6.278429 -0.523356 -0.725196
C  6.590616 0.975017 0.892229
C  -6.584209 0.987967 -0.860541
C  1.671848 0.033074 -1.051279
C  -1.67169 -0.08892 1.03324
H  4.222191 -0.166252 -1.260734
H  -4.22296 -0.299469 1.226918
H  -0.465796 -0.105114 -1.530426
H  0.46698 -0.260992 1.498895
H  3.89963 1.846414 1.05268
H  3.693013 2.191571 -0.69192
H  4.545622 -1.87411 0.546502
H  4.413403 -0.608144 1.795353
H  -3.89404 1.869887 -0.938972
H  -3.700163 2.091807 0.826892
H  -4.543661 -1.879764 -0.690117
H  -4.40161 -0.535455 -1.852299
H  5.965962 2.939167 0.13626
H  6.109309 1.684489 -1.114962
H  6.645319 -0.819571 -0.347047
H  6.826843 -1.149627 1.390328
H  -5.966518 2.896251 0.031918
H  -6.121586 1.560535 1.194262
H  -6.649057 -0.884819 0.256166
H  -6.818496 -1.098338 -1.500692
H  7.673586 1.164386 0.764768
H  6.337901 1.242287 1.938976
H  -7.668253 1.16961 -0.731193
H  -6.320837 1.324243 -1.884523
