program: Gaussian 09
title: 000128618
version: EM64L-G09RevD.01
frameworkgroup: C1[X(C16H16N2O2)]
method: RPBEPBE
basis: SDD
operation: Freq
keyword: #p
keyword: freq=noraman
keyword: PBEPBE/SDD
title: #p freq=noraman PBEPBE/SDD
converged: YES YES NO NO
title: Mulliken charges:
elementType: O O N N C C C C C C C C C C C C C C C C H H H H H H H H H H H H H H H H
charge: -0.234216 -0.263775 -0.480298 0.045178 0.255412 0.174319 0.226610 0.237713 -0.394469 -0.387754 -0.366335 -0.076407 -0.369263 -0.494039 -0.343651 -0.262648 -0.253661 -0.206642 0.199346 -0.689487 0.313722 0.282203 0.244850 0.210440 0.209888 0.238045 0.250909 0.195138 0.195449 0.222515 0.222151 0.229501 0.228338 0.212247 0.212241 0.216429
chargesum: 0.00000
title: Mulliken charges with hydrogens summed into heavy atoms:
elementType: O O N N C C C C C C C C C C C C C C C C
charge: -0.234216 -0.263775 -0.166576 0.045178 0.255412 0.174319 0.226610 0.237713 -0.112265 -0.142904 0.053993 -0.076407 -0.131217 -0.243129 0.046936 0.182018 -0.024160 0.021697 0.199346 -0.048571
polarizability: 3.49352100e+02 -7.08417739e+00 1.91844367e+02 4.84379471e-01 -1.26527449e-01 9.36202021e+01
1716.lowfreq: -22.7054 -6.3527 -1.9113 -0.0010 -0.0007 0.0008 7.8136 32.9591 42.0935
frequency: -15.6578 32.1630 42.0869 53.1919 75.7361 102.6034 119.2745 120.0237 154.1711 177.4356 212.3310 227.6932 238.5953 277.6797 292.4352 353.0463 363.5642 413.6029 424.5374 445.3655 459.9872 479.5976 528.3319 543.4664 568.7472 588.6100 610.3818 623.0585 689.2345 716.8257 737.4437 751.5136 757.3279 767.9971 791.9450 795.1948 806.4812 836.3307 861.5918 868.6656 897.2075 903.7935 916.1473 929.2723 943.9902 949.6043 981.3832 993.3763 1017.0935 1040.2830 1072.2575 1084.4225 1115.3148 1125.4087 1146.7195 1168.5202 1205.4508 1211.2883 1213.8966 1236.2399 1251.7619 1269.1283 1270.2945 1280.1595 1285.3844 1289.1744 1336.1861 1343.8087 1354.8813 1375.3499 1392.3718 1400.5744 1421.6937 1454.9126 1462.1827 1466.5251 1470.7222 1478.7398 1480.0336 1488.8641 1489.4186 1554.1534 1582.5029 1588.9531 1604.0391 1638.0348 2966.3156 2975.3798 2991.9097 2998.6790 3009.9799 3043.2500 3067.7600 3075.0775 3076.8591 3118.3754 3131.8467 3140.7571 3152.6325 3168.2361 3169.5317 3607.9318
redmass: 2.6832 2.5712 4.4602 4.8625 4.2910 2.2126 4.8684 5.3185 3.3650 4.6821 3.9672 4.7107 1.1531 6.1426 5.3998 5.5983 6.1114 3.1850 3.0103 2.9166 6.4275 6.1295 1.1380 5.2933 3.9237 7.0435 8.0217 7.5561 7.3782 4.5875 1.0715 6.2943 1.4797 4.4086 3.3078 1.2112 7.0772 5.2048 1.4819 6.4596 1.4752 2.3628 3.9153 1.1643 1.3780 1.4696 1.3187 3.7127 1.9760 3.2838 4.0261 2.2793 1.7833 2.6399 1.4877 1.1296 2.8562 1.3480 2.1966 1.4422 2.9000 1.3651 1.1976 1.9658 1.0811 2.4649 2.3114 1.6596 2.7866 1.7057 1.2286 5.7088 2.2879 3.1782 3.5641 1.0930 1.0797 1.0420 1.0687 2.1230 1.3849 6.9643 9.1162 8.2021 6.9971 7.8705 1.0587 1.0364 1.0595 1.0571 1.1005 1.1039 1.1038 1.0994 1.1043 1.0918 1.0856 1.0894 1.0957 1.0939 1.0996 1.0803
irintensity: 0.0663 2.0690 1.0471 0.5606 0.0282 0.0755 0.4491 0.0724 1.7891 0.9282 1.5743 6.9838 0.1956 4.8143 4.8369 1.1060 1.8603 14.1418 17.3119 0.5683 1.9683 5.7532 102.0639 0.5614 0.7039 7.0802 1.7785 16.8993 10.6050 35.8186 7.9099 6.7147 78.3509 0.5209 13.9523 2.9854 6.5429 0.3961 0.0001 4.4290 19.8672 44.0743 22.4344 0.6204 6.6352 6.1542 0.0035 11.4905 15.6828 10.1591 271.7839 2.7981 33.8005 3.2382 2.2741 10.6808 82.5998 0.4545 236.8906 22.8269 252.6123 1.4940 1.0080 104.8446 0.0536 7.2443 129.1405 6.3632 69.3403 11.1347 9.1335 5.4459 14.7227 31.0471 5.6774 0.8007 0.1892 12.7486 4.8436 42.3093 20.1755 23.6885 97.6475 65.5075 30.9033 25.8904 30.7438 36.8203 4.3521 51.6556 9.6257 0.0585 0.3853 53.8843 128.0838 21.5489 0.8484 3.0434 24.3903 1.5602 27.5933 70.0726
temp: 298.150 k
press: 1.00000 atm
elementType: 8 8 7 7 6 6 6 6 6 6 6 6 6 6 6 6 6 6 6 6 1 1 1 1 1 1 1 1 1 1 1 1 1 1 1 1
symmnumber: 1
zpe: 752357.3 jmol-1
zpe.correction: 0.286558 hartree
zpe.thermalcorrener: 0.303479 hartree
zpe.thermalcorrenthalpy: 0.304424 hartree
zpe.thermalcorrgfe: 0.240751 hartree
zpe.sumelectzpe: -877.855033 hartree
zpe.sumelectthermal: -877.838112 hartree
zpe.sumelectthermalent: -877.837167 hartree
zpe.sumelectthermalfe: -877.900840 hartree
dipole: 3.4001 2.3729 0.0182
dipole: 4.1462
quadrupole: -85.9167 -108.7209 -120.6692
quadrupole: 8.3964 0.0219 -0.0767
quadrupole: 19.1856 -3.6186 -15.5669 8.3964 0.0219 -0.0767
hfenergy: -878.141591 hartree
pointgroup: C01 [X(C16H16N2O2)]
dipole: -1.3380222 -0.9330945 0.0042392 debye
polarizability: 349.3474187|-7.1396436|191.8482673|-0.3795083|0.3628119|93.6209829 unknown
InChI: InChI=1S/C16H16N2O2/c1-2-3-8-20-16(19)14-9-12-11-6-4-5-7-13(11)18-15(12)10-17-14/h4-7,9-10,18H,2-3,8H2,1H3
charge 0 multiplicity 1
36 atoms
O  3.141902 -0.014837 -0.00695
O  2.052836 2.042659 -0.009376
N  -2.938807 -1.903467 -0.008985
N  0.779932 -1.371963 -0.015775
C  -1.69469 0.036063 -0.003455
C  -3.10631 0.400148 0.002104
C  -1.633711 -1.40304 -0.010098
C  -3.85135 -0.829991 -0.001534
C  -0.480293 0.748297 -0.003693
C  -3.798188 1.633806 0.009942
C  5.548947 -0.330069 0.009637
C  0.726909 0.004221 -0.009819
C  -5.261442 -0.850173 0.002331
C  -0.384346 -2.066208 -0.016158
C  6.953431 0.31899 0.004963
C  4.441507 0.722337 -0.006529
C  -5.208151 1.62252 0.013935
C  -5.928285 0.393848 0.010119
C  2.008131 0.781931 -0.010206
C  8.086766 -0.728356 0.030444
H  -3.191851 -2.889172 -0.012806
H  -0.424464 1.840518 0.000536
H  -3.249121 2.581456 0.012935
H  5.435819 -0.990861 -0.87088
H  5.431143 -0.967869 0.906371
H  -5.824567 -1.789437 -0.000529
H  -0.303948 -3.159674 -0.021364
H  7.052545 0.99236 0.880807
H  7.061739 0.959231 -0.894268
H  4.472344 1.380855 0.882098
H  4.481984 1.363826 -0.907199
H  -5.760829 2.567666 0.020095
H  -7.023653 0.414489 0.013333
H  8.022611 -1.360035 0.936256
H  8.028361 -1.397293 -0.84865
H  9.0812 -0.246078 0.023565
