program: Gaussian 09
title: 000128610
version: EM64L-G09RevD.01
frameworkgroup: C1[X(C17H18F3N3O4)]
method: RPBEPBE
basis: SDD
operation: Freq
keyword: #p
keyword: freq=noraman
keyword: PBEPBE/SDD
title: #p freq=noraman PBEPBE/SDD
converged: YES YES NO NO
title: Mulliken charges:
elementType: F F F O O O O N N N C C C C C C C C C C C C C C C C C H H H H H H H H H H H H H H H H H H
charge: -0.220736 -0.189077 -0.222451 -0.446004 -0.220770 -0.382773 -0.281002 0.035171 -0.180378 -0.161071 -0.362975 -0.355437 -0.406342 -0.391785 -0.561332 0.156186 0.102175 0.201857 0.245968 0.236712 -0.630975 0.086211 -0.403234 -0.291906 0.107322 -0.192862 0.108205 0.225485 0.247278 0.256425 0.209825 0.286700 0.225755 0.242786 0.273060 0.257274 0.259614 0.201510 0.314244 0.256316 0.248713 0.289760 0.231451 0.215622 0.379485
chargesum: 0.00000
title: Mulliken charges with hydrogens summed into heavy atoms:
elementType: F F F O O O O N N N C C C C C C C C C C C C C C C C C
charge: -0.220736 -0.189077 -0.222451 -0.446004 -0.220770 -0.003288 -0.281002 0.035171 -0.180378 -0.161071 0.109788 0.110814 0.106112 0.124061 0.157066 0.156186 0.102175 0.201857 0.245968 0.236712 -0.316732 0.086211 0.101795 -0.002146 0.107322 0.254211 0.108205
polarizability: 3.86599483e+02 1.28901188e+01 2.29177221e+02 1.08924812e+01 -1.37156895e+01 1.33133020e+02
1716.lowfreq: -4.4524 -2.3886 -0.0009 -0.0007 -0.0006 8.9705 15.9343 30.3510 34.5739
frequency: 15.7552 29.8991 34.5499 38.1262 48.2519 55.4402 70.3932 90.9861 116.6189 131.2099 145.6936 158.9750 164.2741 198.9048 208.4045 215.4198 238.0385 258.8774 264.8781 282.8663 288.3623 312.7359 337.4054 344.8498 359.6834 366.1153 377.7683 383.0729 398.4722 423.4609 426.5237 443.2203 448.8641 478.2286 482.3828 497.0341 505.7494 519.6132 552.6670 573.7361 593.5931 600.4802 634.1825 637.9156 653.3645 657.0661 696.7282 716.2091 723.6140 755.5421 794.3470 795.7403 816.2211 835.6626 839.5780 893.9056 921.4777 927.4455 940.4728 941.4958 952.6228 965.3795 984.6807 1001.0763 1018.5345 1026.7258 1042.7377 1059.1803 1062.2003 1091.6305 1095.1577 1115.4220 1126.7839 1147.7061 1169.9722 1180.0704 1191.8156 1212.6248 1220.8796 1232.2608 1255.1252 1259.6367 1277.6230 1289.3348 1326.9887 1338.8213 1339.8882 1345.8284 1356.0929 1362.1266 1363.4292 1368.3066 1376.0515 1391.2410 1392.8117 1408.0446 1426.9979 1444.8137 1446.8374 1447.3078 1456.6886 1460.4617 1463.1955 1464.7082 1477.3676 1505.6554 1536.4340 1562.0115 1587.4985 1628.3253 1630.5709 2989.0932 2993.6665 3002.9914 3015.8409 3017.8845 3026.1368 3055.3355 3101.8449 3104.9224 3106.9793 3114.8395 3122.1380 3123.9677 3124.1211 3147.5730 3163.2295 3164.2934 3495.9259
redmass: 6.1930 6.5792 9.9578 7.4807 7.4146 9.3162 5.2410 6.7062 5.6890 4.9846 5.5784 5.1413 7.1577 5.2247 5.0113 1.0550 4.5434 4.0078 6.8799 3.9114 5.6410 5.7461 4.8773 6.4731 6.8178 3.8162 6.1333 3.2201 3.9700 2.7250 3.2846 3.0628 3.9867 3.1935 4.6053 6.8260 3.7783 4.5636 3.7102 3.3476 2.1556 3.4138 3.1289 3.4865 4.2745 3.4719 6.8189 6.2470 6.0500 2.0906 6.1588 5.7250 6.0435 6.7187 3.2275 1.9794 2.8648 1.4057 3.9667 4.3250 1.6335 2.4208 1.9689 2.9032 3.4354 1.9607 3.3251 2.0524 2.6061 2.2070 2.3274 2.3248 1.9351 1.7424 1.8229 2.6249 1.3352 1.9221 1.5336 1.7650 1.3750 2.0476 1.3961 1.9306 1.2905 1.9023 1.6813 1.4511 1.8275 1.3016 1.5399 1.5007 4.1313 2.7065 2.9161 1.1874 1.0874 1.1007 1.0637 1.1015 1.3139 1.1987 1.0753 1.3621 1.8802 6.3198 6.8168 8.5947 7.5967 7.8323 9.1347 1.0380 1.0688 1.0611 1.0631 1.0610 1.0578 1.0646 1.1017 1.1080 1.1022 1.0989 1.0953 1.0980 1.1013 1.1036 1.0919 1.0930 1.0636
irintensity: 0.5586 1.7888 2.5031 1.3606 0.4206 0.2891 6.3891 3.1380 1.2626 4.7410 15.6933 3.9971 2.9070 2.3280 7.0096 0.0364 1.4882 3.4726 6.4239 0.8277 5.7220 4.3005 11.2097 12.8808 10.8773 11.3190 6.5658 4.6357 7.6616 11.4857 8.0903 0.6231 10.9103 10.5067 10.5850 7.0388 10.4294 0.8681 28.4344 2.8570 75.1921 75.4124 44.4591 11.4324 6.9301 2.4666 17.8452 12.9733 13.8576 3.2993 14.3034 23.4207 9.0116 15.2317 16.8345 0.2871 52.3545 19.9690 28.8862 42.1182 15.5463 14.0914 7.0813 94.0997 26.3159 41.1381 149.2293 136.1495 128.3162 34.1840 11.2747 2.9265 13.9644 10.3200 12.2319 40.2947 33.3380 1.8188 8.8084 11.6497 10.1831 75.1390 45.2680 177.1164 1.3486 17.5150 23.4841 31.6719 15.2546 5.7377 14.7265 18.9852 35.2586 29.9593 49.9536 2.0679 0.3966 69.2591 19.4693 22.2935 51.5819 119.0024 38.1043 21.4811 212.0348 236.6221 94.1325 107.6658 501.1847 363.1319 107.8560 20.1588 15.7034 18.8157 10.7866 43.8846 25.9549 12.9096 11.1043 36.4265 5.8027 30.5138 7.5374 2.5414 2.8421 8.4024 11.5074 5.0833 38.5753
temp: 298.150 k
press: 1.00000 atm
elementType: 9 9 9 8 8 8 8 7 7 7 6 6 6 6 6 6 6 6 6 6 6 6 6 6 6 6 6 1 1 1 1 1 1 1 1 1 1 1 1 1 1 1 1 1 1
symmnumber: 1
zpe: 887754.8 jmol-1
zpe.correction: 0.338128 hartree
zpe.thermalcorrener: 0.363009 hartree
zpe.thermalcorrenthalpy: 0.363953 hartree
zpe.thermalcorrgfe: 0.281817 hartree
zpe.sumelectzpe: -1421.199941 hartree
zpe.sumelectthermal: -1421.175060 hartree
zpe.sumelectthermalent: -1421.174116 hartree
zpe.sumelectthermalfe: -1421.256252 hartree
dipole: 5.1659 5.8139 -4.8054
dipole: 9.1422
quadrupole: -185.4155 -157.4208 -155.8905
quadrupole: 5.7574 -18.8856 -1.1003
quadrupole: -19.1733 8.8215 10.3517 5.7574 -18.8856 -1.1003
hfenergy: -1421.5380692 hartree
pointgroup: C01 [X(C17H18F3N3O4)]
dipole: -2.0530299 2.3365933 1.8062527 debye
polarizability: 385.4489914|-15.0735267|229.856062|18.1166438|11.9543379|133.6046695 unknown
InChI: InChI=1S/C17H18F3N3O4/c1-23(27)6-4-21(5-7-23)15-12(19)8-10-14(13(15)20)22(3-2-18)9-11(16(10)24)17(25)26/h8-9,25H,2-7H2,1H3
charge 0 multiplicity 1
45 atoms
F  -1.000965 1.593678 0.356646
F  -1.549634 -3.084062 -0.776906
F  2.522438 3.434263 -1.446869
O  -6.032841 -0.040047 -0.976438
O  3.373741 -2.694509 0.018013
O  5.908137 -1.554886 0.305803
O  5.989742 0.669229 0.938614
N  -5.380448 0.41584 0.211336
N  -2.695365 -0.494295 -0.39961
N  1.906846 1.212457 0.491679
C  -4.261309 1.415078 -0.163212
C  -4.739074 -0.782205 0.946347
C  -3.269238 0.689752 -1.079607
C  -3.733792 -1.470158 0.00843
C  -6.391314 1.093002 1.11708
C  -1.33008 -0.715615 -0.250777
C  -0.410965 0.321881 0.077787
C  0.995936 0.161321 0.192615
C  -0.720446 -2.004116 -0.407604
C  1.520921 -1.16206 0.030458
C  0.637019 -2.230943 -0.257796
C  2.979691 -1.491901 0.146614
C  1.505731 2.641902 0.610832
C  3.251863 0.932039 0.578475
C  3.829983 -0.323515 0.428556
C  1.248447 3.309728 -0.74058
C  5.306677 -0.334709 0.588521
H  -3.770373 1.790131 0.753541
H  -4.76715 2.230675 -0.704007
H  -5.571109 -1.465971 1.179157
H  -4.252889 -0.427236 1.874799
H  -3.842192 0.344776 -1.963384
H  -2.47661 1.377819 -1.403804
H  -3.278763 -2.326143 0.52654
H  -4.29216 -1.833438 -0.874362
H  -6.824545 1.928824 0.54843
H  -7.180548 0.356048 1.325708
H  -5.924469 1.450811 2.053843
H  1.072304 -3.22583 -0.395888
H  0.611974 2.732527 1.244407
H  2.332983 3.171017 1.112076
H  3.910071 1.781162 0.784146
H  0.574873 2.722613 -1.386466
H  0.852413 4.33102 -0.595515
H  6.890689 -1.449154 0.439274
