program: Gaussian 09
title: 000128580
version: EM64L-G09RevD.01
frameworkgroup: C1[X(C9H17NO)]
method: RPBEPBE
basis: SDD
operation: Freq
keyword: #p
keyword: freq=noraman
keyword: PBEPBE/SDD
title: #p freq=noraman PBEPBE/SDD
converged: NO YES NO NO
title: Mulliken charges:
elementType: O N C C C C C C C C C H H H H H H H H H H H H H H H H H
charge: -0.362199 0.035893 0.380558 -0.532000 -0.454111 -0.472370 -0.746760 -0.367543 -0.201883 -0.353167 -0.698967 0.235355 0.230754 0.200795 0.246717 0.229797 0.227049 0.250319 0.220972 0.221239 0.199459 0.201027 0.270261 0.197172 0.203428 0.210820 0.208589 0.218798
chargesum: 0.00000
title: Mulliken charges with hydrogens summed into heavy atoms:
elementType: O N C C C C C C C C C
charge: -0.362199 0.035893 0.380558 -0.065891 -0.006600 -0.015523 -0.054230 0.032943 0.068378 0.047433 -0.060760
polarizability: 1.24906941e+02 -7.81703610e+00 1.08680267e+02 -5.92043671e+00 1.66010876e+00 8.76480473e+01
1716.lowfreq: -17.3490 -11.8535 -0.0003 0.0006 0.0008 4.7809 46.2740 50.7626 83.8206
frequency: 46.0677 50.6108 83.7541 103.8914 129.4897 208.9676 222.0320 226.2984 228.9973 272.3475 277.6071 337.0440 380.2175 406.5695 536.0467 581.4918 619.3225 673.4338 708.8307 730.1101 747.8750 782.5210 794.8708 878.6648 896.2690 916.3497 933.7994 958.7467 981.2799 1022.8650 1030.1594 1054.7024 1077.0904 1080.3018 1115.6783 1123.5129 1182.9422 1195.3689 1218.1037 1231.0839 1248.1457 1261.4323 1279.6966 1287.0302 1290.0761 1312.3281 1328.8879 1332.5500 1355.7363 1381.3663 1390.4058 1460.0249 1463.1895 1467.6958 1472.7018 1477.4314 1477.9492 1478.5922 1484.8768 1489.3200 1557.4608 2959.1479 2961.6611 2969.6287 2972.4333 2977.2588 2988.1370 3002.5277 3011.4259 3026.4277 3031.3727 3051.6581 3068.8008 3072.2926 3080.5646 3083.7219 3098.5519 3206.8423
redmass: 1.7462 2.7659 2.5152 3.3925 2.0961 3.0861 1.4293 1.1216 1.8624 3.1948 2.7574 2.4382 2.2743 3.1047 3.6551 4.3315 3.1473 3.9261 3.8253 1.0913 1.5522 1.2786 1.4754 2.0059 1.8159 1.3981 2.2979 1.5562 1.8336 1.6538 2.9365 1.6189 2.1858 1.8201 1.4204 1.9071 1.7279 2.0216 2.8022 1.9427 1.5773 1.3197 1.4945 1.0913 1.6441 1.4222 1.6906 1.5401 1.6193 1.2176 1.2169 1.0745 1.0818 1.0674 1.0691 1.0469 1.0896 1.0616 1.0731 1.0909 6.5692 1.0591 1.0673 1.0595 1.0369 1.0628 1.0359 1.0955 1.0669 1.1012 1.0895 1.1010 1.1008 1.0992 1.1030 1.0998 1.1000 1.0946
irintensity: 0.4757 1.2987 0.9948 2.1462 0.2212 1.7444 1.7607 0.0075 0.2520 1.0644 4.3390 1.5628 1.2241 3.6277 1.3343 6.2727 10.3121 8.5510 2.2467 9.6407 37.3135 0.3772 1.8728 0.3203 8.5757 0.5543 4.5492 1.9739 1.0369 2.1705 5.3461 5.9568 1.9982 1.3458 3.4118 13.9379 21.8302 15.7085 25.8168 5.6088 0.4800 10.9999 14.1923 0.6569 7.8591 4.2239 5.3500 8.3072 0.1936 22.9076 12.3169 1.1635 7.0041 0.7283 8.4247 13.2780 7.6947 2.5013 5.7573 17.6155 73.1253 6.7144 48.0064 29.5747 34.9234 50.6647 15.1830 4.9741 19.2092 11.7355 34.2624 25.0638 89.6586 52.1189 29.3687 33.2249 14.8353 4.7480
temp: 298.150 k
press: 1.00000 atm
elementType: 8 7 6 6 6 6 6 6 6 6 6 1 1 1 1 1 1 1 1 1 1 1 1 1 1 1 1 1
symmnumber: 1
zpe: 645413.2 jmol-1
zpe.correction: 0.245825 hartree
zpe.thermalcorrener: 0.258370 hartree
zpe.thermalcorrenthalpy: 0.259314 hartree
zpe.thermalcorrgfe: 0.206716 hartree
zpe.sumelectzpe: -482.187132 hartree
zpe.sumelectthermal: -482.174587 hartree
zpe.sumelectthermalent: -482.173643 hartree
zpe.sumelectthermalfe: -482.226241 hartree
dipole: -0.6367 -3.9866 0.4212
dipole: 4.0590
quadrupole: -66.3868 -75.5998 -67.4064
quadrupole: -8.4442 -0.2588 1.6628
quadrupole: 3.4109 -5.8021 2.3913 -8.4442 -0.2588 1.6628
hfenergy: -482.4329568 hartree
pointgroup: C01 [X(C9H17N1O1)]
dipole: 0.2637712 -1.5743712 -0.0445844 debye
polarizability: 124.9188983|7.5178637|108.433097|-6.0751525|-3.1910128|87.8832597 unknown
InChI: InChI=1S/C9H17NO/c1-3-4-6-9(2)7-5-8-10(9)11/h8H,3-7H2,1-2H3
charge 0 multiplicity 1
28 atoms
O  -1.715039 2.060343 0.05948
N  -1.754715 0.744927 0.141719
C  -0.546519 -0.094077 -0.379749
C  -0.891451 -1.512225 0.154335
C  0.735181 0.520269 0.226177
C  -2.426443 -1.501818 0.455953
C  -0.58526 0.008688 -1.919853
C  2.04311 -0.190473 -0.186931
C  -2.743697 -0.034949 0.583127
C  3.276565 0.390109 0.543806
C  4.597056 -0.291181 0.125961
H  -0.332343 -1.704392 1.087706
H  -0.617258 -2.297504 -0.569464
H  0.642893 0.495909 1.331447
H  0.771398 1.588017 -0.061732
H  -2.668817 -2.066046 1.375115
H  -3.009079 -1.968814 -0.365146
H  -0.520387 1.067242 -2.226893
H  0.258222 -0.544177 -2.366987
H  -1.524078 -0.413326 -2.322638
H  1.974538 -1.27701 0.030366
H  2.20219 -0.096565 -1.279624
H  -3.671897 0.412925 0.939378
H  3.133911 0.286719 1.638767
H  3.338428 1.478419 0.340992
H  4.778265 -0.173413 -0.959175
H  4.572608 -1.37543 0.345723
H  5.462117 0.141832 0.66084
