program: Gaussian 09
title: 000128583
version: EM64L-G09RevD.01
frameworkgroup: C1[X(C10H19NO)]
method: RPBEPBE
basis: SDD
operation: Freq
keyword: #p
keyword: freq=noraman
keyword: PBEPBE/SDD
title: #p freq=noraman PBEPBE/SDD
converged: YES YES NO NO
title: Mulliken charges:
elementType: O N C C C C C C C C C C H H H H H H H H H H H H H H H H H H H
charge: -0.360851 0.018779 0.433343 -0.548166 -0.485033 -0.431336 -0.473910 -0.208508 -0.374721 -0.384131 -0.695703 -0.702578 0.236250 0.232145 0.199064 0.251125 0.205775 0.202578 0.231321 0.228456 0.270579 0.211658 0.208382 0.199612 0.258059 0.217039 0.211259 0.215965 0.202841 0.209524 0.221185
chargesum: 0.00000
title: Mulliken charges with hydrogens summed into heavy atoms:
elementType: O N C C C C C C C C C C
charge: -0.360851 0.018779 0.433343 -0.079771 -0.034844 -0.022983 -0.014132 0.062071 0.045318 0.073539 -0.051440 -0.069029
polarizability: 1.28647442e+02 8.39306733e+00 1.14878525e+02 6.08438274e+00 7.83735156e+00 1.09141634e+02
1716.lowfreq: -9.7457 0.0000 0.0004 0.0006 8.2970 12.9235 59.0951 70.8311 77.5019
frequency: 59.0403 70.8154 77.4444 109.7451 113.3726 133.2817 186.1516 226.1373 229.7001 233.7875 266.3217 289.8679 308.2324 324.3416 355.1376 428.4955 529.8227 595.7728 627.4133 671.5949 715.2152 743.1871 750.1642 751.8916 795.5298 849.5442 868.8977 896.3121 899.8024 931.7287 953.3676 975.1392 1009.2687 1042.7397 1048.4983 1054.9746 1089.3521 1104.4936 1115.7004 1132.7970 1176.0113 1189.9131 1207.6858 1220.3993 1240.5219 1254.6839 1273.3309 1280.6107 1288.2723 1295.4213 1309.4282 1312.9827 1329.9350 1355.1101 1359.4772 1391.1045 1391.4567 1455.5378 1464.2333 1472.6700 1473.1207 1476.2856 1476.9508 1478.4709 1479.9462 1487.7536 1494.0005 1552.6991 2960.3223 2962.2444 2968.1158 2969.0570 2975.1891 2980.4892 2990.6716 3007.1824 3010.5612 3016.0461 3031.8471 3045.9807 3052.2752 3072.1301 3072.6998 3074.9042 3075.1935 3078.1778 3207.0998
redmass: 3.0773 2.8135 1.8710 1.6086 2.9257 3.0106 2.5643 1.3601 1.4017 1.7581 2.1161 4.3224 2.9764 2.3623 3.1479 2.6151 4.0158 3.8744 3.2286 3.5797 2.1158 1.2195 1.3777 1.4324 1.6107 1.4785 1.4525 1.6496 1.7935 2.2613 2.0122 1.7382 1.8217 2.3314 1.8348 2.3290 2.0694 1.5645 1.7569 1.7764 1.7263 2.5381 2.5446 1.9746 1.3909 1.5034 1.4306 1.2166 1.2857 1.2837 1.2859 1.5087 1.6964 1.5147 1.6084 1.2137 1.2112 1.0811 1.0922 1.0745 1.0600 1.0440 1.0659 1.0467 1.0759 1.0802 1.0919 6.3781 1.0599 1.0664 1.0570 1.0385 1.0371 1.0647 1.0661 1.0779 1.0837 1.0963 1.0909 1.0984 1.0984 1.1003 1.0993 1.0996 1.1010 1.1033 1.0947
irintensity: 0.0145 1.5954 1.1199 0.1268 2.5470 3.4350 0.6417 0.3135 0.1680 0.1809 0.1308 4.0470 3.7172 0.3796 1.7183 0.6124 3.7629 8.9587 5.8394 7.8113 8.0037 3.5901 37.1147 9.6738 0.0405 1.3772 1.6321 4.2689 7.4826 2.2749 0.6827 6.1668 4.3637 1.0699 4.1747 0.5650 2.9565 0.3758 6.9732 12.7896 14.7982 25.3068 12.7376 12.7672 2.1232 1.4705 22.2677 0.8419 5.9271 1.6879 4.0416 0.5984 6.8628 2.0889 1.3017 16.0019 5.0876 4.9418 5.4953 3.8926 4.2350 10.9421 11.9516 10.6818 3.5243 22.9323 3.7342 71.6971 2.6627 51.6892 17.4957 62.0496 29.6089 28.3713 25.4836 3.7739 48.9008 11.6614 33.7814 3.9652 9.5968 21.2048 96.7285 49.0059 51.9443 44.7493 4.2671
temp: 298.150 k
press: 1.00000 atm
elementType: 8 7 6 6 6 6 6 6 6 6 6 6 1 1 1 1 1 1 1 1 1 1 1 1 1 1 1 1 1 1 1
symmnumber: 1
zpe: 719573.4 jmol-1
zpe.correction: 0.274071 hartree
zpe.thermalcorrener: 0.287815 hartree
zpe.thermalcorrenthalpy: 0.288759 hartree
zpe.thermalcorrgfe: 0.233982 hartree
zpe.sumelectzpe: -521.408341 hartree
zpe.sumelectthermal: -521.394597 hartree
zpe.sumelectthermalent: -521.393653 hartree
zpe.sumelectthermalfe: -521.448431 hartree
dipole: 0.1030 -1.2839 -3.7261
dipole: 3.9424
quadrupole: -70.8353 -73.4143 -82.6322
quadrupole: 2.6038 4.2424 0.2811
quadrupole: 4.7919 2.2130 -7.0049 2.6038 4.2424 0.2811
hfenergy: -521.6824125 hartree
pointgroup: C01 [X(C10H19N1O1)]
dipole: 0.0124124 -0.5956731 1.4320748 debye
polarizability: 130.6983164|-5.9857692|113.340825|7.4183451|-6.5898988|108.6284595 unknown
InChI: InChI=1S/C10H19NO/c1-3-6-10(7-4-2)8-5-9-11(10)12/h9H,3-8H2,1-2H3
charge 0 multiplicity 1
31 atoms
O  1.071274 0.451768 -2.040053
N  1.324139 -0.094874 -0.86409
C  0.173729 -0.310348 0.169412
C  0.853831 -1.280241 1.178458
C  -1.023176 -0.924422 -0.586821
C  -0.134967 1.063908 0.835101
C  2.393068 -1.066179 1.009621
C  2.503307 -0.487412 -0.376263
C  -2.264701 -1.177528 0.297439
C  -0.72609 2.161959 -0.079317
C  -3.393856 -1.882524 -0.4853
C  -0.905861 3.494832 0.678924
H  0.594921 -2.32406 0.924314
H  0.520623 -1.091462 2.212683
H  -0.694562 -1.884041 -1.035573
H  -1.282648 -0.262911 -1.433912
H  0.801667 1.44368 1.294595
H  -0.833704 0.875967 1.675675
H  2.955031 -2.012362 1.113248
H  2.798151 -0.370874 1.773872
H  3.408566 -0.351169 -0.968682
H  -2.644762 -0.217407 0.69839
H  -1.985171 -1.796188 1.174681
H  -1.706516 1.830538 -0.474051
H  -0.070569 2.300883 -0.957254
H  -3.710028 -1.275704 -1.354364
H  -3.057827 -2.864226 -0.868775
H  -4.281682 -2.052314 0.150918
H  -1.570687 3.374176 1.556178
H  0.065425 3.879064 1.044751
H  -1.347425 4.268968 0.025196
