program: Gaussian 09
title: 000128600
version: EM64L-G09RevD.01
frameworkgroup: C1[X(C16H10Br2O4)]
method: RPBEPBE
basis: SDD
operation: Freq
keyword: #p
keyword: freq=noraman
keyword: PBEPBE/SDD
title: #p freq=noraman PBEPBE/SDD
converged: YES YES NO NO
title: Mulliken charges:
elementType: Br Br O O O O C C C C C C C C C C C C C C C C H H H H H H H H H H
charge: 0.038498 0.063382 -0.288473 -0.240297 -0.423379 -0.378555 0.147167 0.118608 0.229021 0.171992 0.329944 0.050802 -0.490854 -0.822886 -0.333335 -0.322177 -0.332576 0.292595 -0.368913 -0.400505 -0.393523 0.520142 0.304352 0.237628 0.279857 0.238537 0.261230 0.281331 0.279279 0.229963 0.358061 0.363085
chargesum: 0.00000
title: Mulliken charges with hydrogens summed into heavy atoms:
elementType: Br Br O O O O C C C C C C C C C C C C C C C C
charge: 0.038498 0.063382 -0.288473 -0.240297 -0.065317 -0.015470 0.147167 0.118608 0.229021 0.171992 0.329944 0.050802 -0.186502 -0.066865 -0.072105 -0.040846 -0.053297 0.292595 -0.138950 -0.400505 -0.393523 0.520142
polarizability: 3.77383828e+02 -3.90271951e+00 2.66935432e+02 -2.05982134e+00 -1.77603711e+01 1.01179793e+02
1716.lowfreq: -4.7541 -3.9294 -0.0006 -0.0006 -0.0004 2.3747 17.4129 36.5699 48.8907
frequency: 17.3740 36.5625 48.8897 76.1655 82.2369 104.9069 109.3772 152.9814 167.9757 181.2769 190.9391 191.4745 213.0153 239.6080 254.0187 280.1570 304.7460 336.7895 338.6431 345.0894 375.5930 382.8136 387.3846 409.3669 443.6261 455.0223 489.4246 492.9821 519.9691 525.2764 552.2852 562.0205 611.8655 646.3432 659.7094 687.2178 692.3793 712.7464 728.3032 756.2178 777.2909 787.0571 805.8790 854.2819 891.0091 899.2248 903.4023 915.3957 935.8067 997.7499 1020.3512 1039.5362 1046.1986 1090.2488 1111.1852 1134.9023 1136.6697 1168.9809 1194.5697 1223.6976 1238.9897 1256.0520 1271.7653 1296.8994 1332.9849 1376.9017 1397.9668 1400.9618 1413.1154 1449.4629 1455.7190 1458.4210 1475.7642 1478.4148 1546.0532 1548.2182 1574.8511 1595.5440 1602.2057 1638.1661 2981.4146 3063.9165 3105.1296 3126.5980 3172.2380 3178.3183 3187.4064 3194.7438 3473.6015 3584.9452
redmass: 7.8218 8.7562 9.9225 5.6212 10.9796 4.5520 21.1661 6.5926 7.4044 2.1952 5.6705 6.8521 2.3035 4.4053 8.0367 9.0997 5.2465 3.1723 1.3791 3.2691 7.0025 5.9049 5.6927 6.1520 3.5413 1.1302 6.5449 4.7152 5.0122 9.0363 4.1586 4.5257 7.8083 6.9406 6.1849 6.2943 4.7482 9.2849 5.1303 6.4050 4.6191 6.0944 1.5349 6.2027 1.9607 2.3692 1.4156 1.4602 1.3474 3.5445 2.8651 1.5516 2.4114 3.0151 2.3791 1.5231 1.4538 1.7779 2.0775 1.9122 1.7760 4.7239 1.8125 2.6267 4.8623 4.2820 4.3770 1.3174 7.6146 2.5102 1.9667 1.8374 3.2985 1.1582 7.0402 7.5433 7.4510 8.1077 7.4658 7.1014 1.0404 1.0921 1.1004 1.0901 1.0951 1.0927 1.0924 1.0924 1.0648 1.0662
irintensity: 0.7465 0.7410 0.6083 3.9883 0.0601 1.8546 0.0134 0.1318 0.5357 0.3672 0.5412 0.2019 1.0899 2.7763 6.0482 1.0236 2.6369 48.7040 93.5454 3.1506 4.6598 13.4798 12.0634 7.6791 0.8168 128.8875 5.4957 6.1107 9.6604 3.9668 19.5863 7.7471 20.0901 12.4392 8.1788 4.3982 2.1887 75.5627 15.3683 81.4938 4.4673 21.4624 58.3649 6.0262 50.8873 20.6350 12.8124 9.7141 5.7241 0.7212 6.2989 3.4500 3.9696 35.0745 32.8061 347.8406 19.8356 147.2778 42.4046 9.7174 141.0365 10.4531 30.9429 24.4226 498.6452 57.2638 13.0784 39.3167 25.5271 2.4217 124.8518 30.3556 165.5135 13.3986 222.9760 97.6948 42.3848 14.6372 59.2394 19.2254 19.0877 12.7125 6.0559 15.3850 1.4064 6.8168 0.4395 0.1616 106.3014 63.8906
temp: 298.150 k
press: 1.00000 atm
elementType: 35 35 8 8 8 8 6 6 6 6 6 6 6 6 6 6 6 6 6 6 6 6 1 1 1 1 1 1 1 1 1 1
symmnumber: 1
zpe: 571653.4 jmol-1
zpe.correction: 0.217731 hartree
zpe.thermalcorrener: 0.237655 hartree
zpe.thermalcorrenthalpy: 0.238599 hartree
zpe.thermalcorrgfe: 0.167058 hartree
zpe.sumelectzpe: -941.976894 hartree
zpe.sumelectthermal: -941.956971 hartree
zpe.sumelectthermalent: -941.956027 hartree
zpe.sumelectthermalfe: -942.027567 hartree
dipole: 0.0496 5.5868 -1.3908
dipole: 5.7575
quadrupole: -143.0831 -139.3653 -147.9045
quadrupole: -21.7254 13.2663 -0.8366
quadrupole: 0.3678 4.0856 -4.4535 -21.7254 13.2663 -0.8366
hfenergy: -942.1946254 hartree
pointgroup: C01 [X(C16H10Br2O4)]
dipole: -0.0121699 2.0656911 -0.9294012 debye
polarizability: 377.1170772|-1.6683626|220.7722535|-9.5296883|-76.310988|147.6097214 unknown
InChI: InChI=1S/C16H10Br2O4/c1-7-14(20)10-6-9(19)2-3-13(10)22-16(7)8-4-11(17)15(21)12(18)5-8/h2-6,19,21H,1H3
charge 0 multiplicity 1
32 atoms
Br -4.086001 2.389743 -2.304042
Br -5.089406 -1.372163 2.00313
O  0.617881 0.760995 -0.256755
O  2.645793 -2.744417 0.720988
O  6.224888 0.826586 -0.210508
O  -5.71576 0.68035 -0.191787
C  -0.09532 -0.409794 0.075063
C  0.54628 -1.601394 0.383217
C  2.751826 -0.413032 0.097052
C  2.022384 0.752192 -0.247659
C  -1.549407 -0.139823 0.004634
C  2.027333 -1.665964 0.428839
C  4.166034 -0.359542 0.101042
C  -0.175628 -2.905549 0.644446
C  2.669349 1.959728 -0.582462
C  -2.475943 -0.778323 0.872884
C  -2.036524 0.814482 -0.930389
C  4.821905 0.837698 -0.232444
C  4.07379 2.001806 -0.575068
C  -3.408187 1.083039 -0.997419
C  -3.847629 -0.49114 0.791566
C  -4.354477 0.442102 -0.150893
H  4.730207 -1.258792 0.36278
H  -0.37936 -3.05376 1.722501
H  0.488514 -3.733364 0.34446
H  -1.129039 -2.978423 0.096044
H  2.074256 2.841071 -0.83688
H  -2.126544 -1.474892 1.636519
H  -1.336585 1.331059 -1.590064
H  4.589807 2.935336 -0.832473
H  6.596732 1.708953 -0.458866
H  -5.931967 1.355429 -0.890956
