program: Gaussian 09
title: 000012155
version: EM64L-G09RevD.01
frameworkgroup: C1[X(C9H12O)]
method: RPBEPBE
basis: SDD
operation: Freq
keyword: #pfreq=noraman
keyword: PBEPBE/SDD
title: #p freq=noraman PBEPBE/SDD
converged: YES YES NO NO
title: Mulliken charges:
elementType: O C C C C C C C C C H H H H H H H H H H H H
charge: -0.273529 -0.393622 -0.256236 0.360302 -0.678617 -0.354908 -0.378497 -0.221970 -0.196784 -0.258732 0.218455 0.218616 0.200505 0.200445 0.209627 0.227171 0.209924 0.245399 0.248664 0.221494 0.225885 0.226409
chargesum: 0.00000
title: Mulliken charges with hydrogens summed into heavy atoms:
elementType: O C C C C C C C C C
charge: -0.273529 0.043449 0.144713 0.360302 -0.031895 -0.109509 -0.129833 -0.000476 0.029101 -0.032323
polarizability: 1.41650951e+02 -2.48141115e-01 9.88873559e+01 -1.18233659e-01 -2.50164671e-03 5.48133087e+01
1716.lowfreq: 0.0007 0.0009 0.0009 8.4957 14.5016 19.4405 53.9341 88.6217 106.7908
frequency: 53.5925 88.5685 106.7867 143.0381 218.6564 238.7640 282.2526 302.0543 412.9658 469.8798 504.0558 575.1752 611.0849 692.4850 757.9367 771.1989 789.1671 822.8030 887.0341 900.1533 902.6442 960.8760 977.4491 981.6106 986.9885 1023.1264 1053.3741 1083.3784 1136.5466 1140.6602 1166.7337 1178.2966 1219.1716 1229.8175 1286.3274 1310.4563 1313.8662 1374.8114 1390.7463 1398.2629 1443.7815 1471.1394 1477.1703 1481.6550 1483.4505 1492.5184 1591.3566 1612.7897 2943.8076 2979.0491 3001.1658 3005.1769 3052.8281 3081.1959 3083.6010 3126.4947 3135.2253 3153.9767 3162.4080 3171.7217
redmass: 4.0959 1.6328 3.5815 2.5449 1.4082 2.6669 3.2138 4.2452 2.9354 3.8668 2.8500 7.2861 6.4207 2.0218 1.6412 1.0942 6.2485 1.2456 1.3960 1.1775 1.7308 1.3567 5.8793 1.2971 6.7733 2.0421 2.7106 1.5382 2.1966 1.4331 1.0817 1.1746 3.3601 1.2715 1.1051 1.3480 1.3392 1.8089 3.2061 1.2834 2.3797 1.2740 1.2562 1.0415 1.2762 1.1609 6.4413 6.2366 1.0550 1.0363 1.1063 1.0603 1.1014 1.1028 1.0988 1.0846 1.0890 1.0924 1.0954 1.1005
irintensity: 0.7460 0.0038 0.2375 4.4937 0.3968 0.3737 1.2434 1.4680 0.0486 0.2555 12.3877 4.2324 0.5279 36.3790 96.2323 0.1084 18.9205 0.8312 4.5870 5.1553 7.2410 0.0780 40.5033 0.6809 37.7757 21.8894 4.2777 14.0167 5.6270 0.1925 9.0347 40.5253 212.5807 0.2544 0.0344 0.8375 0.6851 3.8962 7.8990 28.5464 2.3818 62.6828 26.6123 13.6218 40.1972 4.1378 21.9983 77.0840 35.4098 37.7186 30.6861 24.2889 0.1262 85.0431 43.5738 2.7963 12.5040 33.2107 24.0764 5.9060
temp: 298.150 k
press: 1.00000 atm
elementType: 8 6 6 6 6 6 6 6 6 6 1 1 1 1 1 1 1 1 1 1 1 1
symmnumber: 1
zpe: 488634.5 jmol-1
zpe.correction: 0.186111 hartree
zpe.thermalcorrener: 0.195963 hartree
zpe.thermalcorrenthalpy: 0.196908 hartree
zpe.thermalcorrgfe: 0.150474 hartree
zpe.sumelectzpe: -424.613229 hartree
zpe.sumelectthermal: -424.603376 hartree
zpe.sumelectthermalent: -424.602432 hartree
zpe.sumelectthermalfe: -424.648866 hartree
dipole: 1.1671 1.2369 0.0056
dipole: 1.7006
quadrupole: -52.3721 -56.9111 -64.1238
quadrupole: 1.6163 -0.0161 -0.0097
quadrupole: 5.4302 0.8912 -6.3215 1.6163 -0.0161 -0.0097
hfenergy: -424.79934 hartree
pointgroup: C01 [X(C9H12O1)]
dipole: 0.4544636 0.4909808 -0.0079603 debye
dipolederiv: -1.9486587 0.0005395 -0.0375053 0.0752469 -0.31059 0.0026064 -0.0413007 0.0005683 -0.2843651 -0.020973 -0.0096157 -0.0034358 -0.0536563 0.0819337 0.0014862 -0.0014623 0.0021924 0.1382911 0.917547 0.1250303 0.0060534 0.4640105 0.2951799 0.0152365 -0.0067846 0.0074452 0.4029339 1.5563947 -0.1550327 0.0388436 -0.4704602 0.0965363 -0.010368 0.0516925 -0.0028442 0.1107425 -0.0640641 -0.0356073 -0.0024655 0.0372322 0.0394968 0.0038836 -0.0062684 0.002352 0.1015915 -0.2925097 -0.0056865 -0.0020745 0.3778529 -0.0964122 0.003013 -0.018131 -0.0055392 -0.2198984 -0.4314671 0.0579945 -0.0080913 -0.1726537 0.0532294 -0.0139406 0.0015569 -0.0091728 -0.1932574 0.1489564 0.0764038 0.0028209 -0.054873 0.1540242 -0.0136817 0.008412 -0.0110946 -0.1416006 0.1634476 -0.0284597 0.0074789 0.0133654 0.1593076 -0.0126245 0.0059251 -0.01334 -0.1450635 -0.0484968 -0.0766571 0.0060535 -0.0222441 -0.2106429 -0.0001465 0.0041108 -0.0012376 -0.2059513 0.0500969 -0.020983 0.0096509 0.0147666 -0.0042389 0.1057786 -0.0066001 0.1248065 -0.0769897 0.0504965 -0.0154678 -0.0021081 0.0210272 -0.0265877 -0.1095906 0.0105806 -0.1302517 -0.0539455 -0.0307596 0.0251564 0.0312305 -0.0923854 -0.0639626 -0.1048958 0.0046478 -0.1169905 -0.0845291 -0.0298109 0.0159625 -0.0288797 -0.0982574 -0.0451805 0.0971953 0.0070909 0.1147612 -0.1054497 0.0915631 0.0119287 0.0369573 -0.0419842 -0.0325278 -0.1244335 -0.0050384 -0.1386874 -0.0721705 -0.1769679 0.083116 -0.011866 0.1099064 0.0318577 0.0070338 -0.0133603 0.0062054 0.1052411 0.0920969 0.0007867 -0.0276434 -0.0476107 -0.0060347 0.1150504 0.0197103 0.1321042 -0.0995741 -0.0096417 -0.1037309 0.0009728 -0.1183668 0.0089956 0.0042499 0.0014712 0.0045999 0.1678146 0.0852878 0.062526 -0.0043384 0.0497732 -0.053582 0.0105014 -0.004066 0.0109282 0.1713842 0.0567404 0.0511191 -0.0041849 0.0731254 -0.115775 0.0130082 -0.0050351 0.0125922 0.1549178 -0.0306496 -0.1104661 0.000789 -0.116017 -0.0276273 0.0053311 0.0011872 0.0053556 0.1559785 -0.1286282 0.0511431 -0.0082577 0.0522022 0.0726005 0.0053067 -0.0083385 0.0052468 0.1738997 unknown
polarizability: 141.6115888|0.2271977|98.808877|1.8657781|-1.8463449|54.9311494 unknown
InChI: InChI=1S/C9H12O/c1-2-8-10-9-6-4-3-5-7-9/h3-7H,2,8H2,1H3
charge 0 multiplicity 1
22 atoms
O  0.886705 -0.727805 0.134152
C  3.289308 -0.463149 0.187805
C  1.956721 0.286577 0.1186
C  -0.443649 -0.280856 0.085787
C  4.490689 0.507189 0.171158
C  -0.829863 1.081985 0.020288
C  -1.428335 -1.301276 0.10815
C  -2.205922 1.409894 -0.021155
C  -2.793443 -0.957728 0.066206
C  -3.192868 0.400792 0.001429
H  3.305037 -1.077667 1.107133
H  3.349081 -1.162834 -0.666512
H  1.839336 0.966698 0.988753
H  1.888149 0.888063 -0.81248
H  4.458313 1.204353 1.029609
H  5.443121 -0.048721 0.226853
H  4.508325 1.111799 -0.755134
H  -0.084105 1.882275 0.001182
H  -1.100921 -2.344448 0.158702
H  -2.501897 2.464078 -0.071672
H  -3.548674 -1.751536 0.084243
H  -4.255208 0.664418 -0.030894
