program: Gaussian 09
title: 000128503
version: EM64L-G09RevD.01
frameworkgroup: C1[X(C15H21NO2S)]
method: RPBEPBE
basis: SDD
operation: Freq
keyword: #p
keyword: freq=noraman
keyword: PBEPBE/SDD
title: #p freq=noraman PBEPBE/SDD
converged: YES YES NO NO
title: Mulliken charges:
elementType: S O O N C C C C C C C C C C C C C C C H H H H H H H H H H H H H H H H H H H H H
charge: 0.172931 -0.259993 -0.271427 -0.107513 -0.033130 -0.055109 -0.597310 -0.630715 0.116657 0.411598 -0.360133 -0.306936 -0.642463 0.179718 -0.466625 -0.393516 -0.246506 -0.533606 -0.837415 0.215541 0.225824 0.251786 0.250356 0.271729 0.228247 0.203974 0.189506 0.211615 0.191747 0.218332 0.249230 0.190284 0.242000 0.254774 0.243042 0.222873 0.220539 0.264408 0.263431 0.252252
chargesum: 0.00000
title: Mulliken charges with hydrogens summed into heavy atoms:
elementType: S O O N C C C C C C C C C C C C C C C
charge: 0.172931 -0.259993 -0.271427 -0.107513 0.182412 0.170715 -0.095168 -0.130739 0.116657 0.411598 0.033347 0.096426 0.015384 0.179718 -0.466625 -0.151515 0.008268 0.152848 -0.057324
polarizability: 2.22622215e+02 -3.03011258e+00 2.32098384e+02 -1.60744159e+00 -4.56475960e+00 1.25067197e+02
1716.lowfreq: -4.8699 0.0009 0.0017 0.0022 4.1411 11.1631 42.8931 45.5361 50.8069
frequency: 42.7971 45.5096 50.7939 78.9228 110.2342 118.5873 130.1696 147.8632 164.5366 171.7137 191.5939 213.4010 233.2894 248.4144 267.2039 274.8048 299.2824 337.2058 341.2751 368.8560 383.2100 394.4120 421.3755 424.9422 472.2024 494.7663 528.9972 546.8911 575.4642 590.2402 603.3593 641.8670 646.5387 690.3176 733.8565 779.3042 807.8622 830.2575 870.1593 879.5912 904.0179 918.9514 937.6267 960.4667 964.5620 979.3627 985.8963 1040.2537 1043.5034 1055.8387 1076.7949 1080.5856 1088.4783 1113.4801 1121.6677 1125.2303 1134.3190 1142.4689 1157.4323 1171.1545 1187.4158 1194.4322 1217.2666 1219.8118 1231.6110 1240.2792 1272.1832 1288.8529 1295.8237 1310.6289 1324.3170 1335.2199 1346.9881 1354.9867 1370.2125 1372.9554 1383.8743 1420.0011 1432.2711 1433.5401 1444.3008 1449.9158 1452.6533 1455.8568 1459.2132 1464.1485 1468.0831 1469.8680 1477.0787 1480.4029 1483.8417 1579.6949 1590.3782 2829.2292 2853.1185 2866.9861 2941.8160 2959.5495 2961.6026 2975.3764 2977.0102 3008.7051 3021.0223 3031.8368 3047.7666 3049.2236 3050.0679 3078.2173 3090.2586 3123.7025 3129.6097 3133.4396 3146.7731 3170.1507
redmass: 3.4523 3.1201 3.2725 3.1322 3.2186 2.2817 1.6263 3.1063 3.2400 2.9994 3.2137 2.2551 2.4290 1.2063 1.5018 2.8951 4.5228 2.6068 3.9796 4.5755 5.1488 3.8196 2.9535 3.6777 3.9738 2.9699 4.3735 3.6583 3.5708 3.6605 3.4708 4.9110 5.7967 4.9183 3.2219 2.9468 1.4731 3.2342 3.2106 3.7567 2.3059 2.2736 1.3432 1.1919 3.3406 2.7886 1.2799 2.4742 3.3050 2.9937 1.8351 2.6174 2.5458 1.2624 1.5905 2.1510 1.7867 1.9522 1.7567 1.7299 1.7957 1.5396 1.5637 1.4659 1.6559 2.5017 1.4215 1.4375 1.4541 1.5655 1.5194 1.1513 1.3370 1.4417 2.7371 1.8252 1.4778 3.1815 1.2539 1.2623 1.0691 1.0960 1.6192 1.1949 1.0854 1.0802 1.0501 1.1537 1.0927 1.1348 1.0517 7.0666 7.4977 1.0793 1.0649 1.0618 1.0831 1.0660 1.0328 1.0655 1.0649 1.0279 1.0891 1.0739 1.0947 1.0937 1.1037 1.0976 1.0994 1.0997 1.1041 1.1054 1.0879 1.0957
irintensity: 1.0372 1.0519 1.0200 0.7079 2.8136 0.5790 1.0440 4.7095 1.6251 1.8846 0.3431 1.7355 4.7733 0.5451 0.9251 5.5498 2.6148 2.0499 2.0324 3.7559 0.7941 8.5214 1.5755 2.1541 1.2484 1.1857 1.5936 5.0224 9.1886 2.9855 13.3154 2.2191 2.5620 6.8947 0.1548 3.1546 52.0384 3.6244 9.6381 5.3161 7.1043 10.7655 0.9224 8.8447 6.5292 24.2803 25.6952 11.2904 97.3223 57.5412 16.6998 55.8287 12.2587 0.1282 6.9896 4.5323 3.7592 28.0610 5.9461 9.3680 6.4548 6.4643 5.4107 0.1602 57.2545 109.2592 16.3911 6.7057 14.9422 7.3702 3.9127 1.1787 5.8345 17.4268 2.5957 9.1953 6.3397 4.1043 25.3383 12.2025 9.8907 8.7461 83.6849 4.7639 2.4940 22.1866 13.3197 24.3363 14.2361 4.5450 20.7046 27.5063 27.1238 41.7726 43.5641 187.0786 28.1520 79.2668 74.3221 1.9662 34.1620 36.4474 52.7328 50.6252 5.2909 13.9479 50.9396 44.0324 30.5389 23.1005 16.8433 13.7749 3.4949 15.0339
temp: 298.150 k
press: 1.00000 atm
elementType: 16 8 8 7 6 6 6 6 6 6 6 6 6 6 6 6 6 6 6 1 1 1 1 1 1 1 1 1 1 1 1 1 1 1 1 1 1 1 1 1
symmnumber: 1
zpe: 873918.3 jmol-1
zpe.correction: 0.332858 hartree
zpe.thermalcorrener: 0.351850 hartree
zpe.thermalcorrenthalpy: 0.352794 hartree
zpe.thermalcorrgfe: 0.285810 hartree
zpe.sumelectzpe: -1185.970355 hartree
zpe.sumelectthermal: -1185.951363 hartree
zpe.sumelectthermalent: -1185.950419 hartree
zpe.sumelectthermalfe: -1186.017403 hartree
dipole: -0.2969 3.3630 1.9092
dipole: 3.8785
quadrupole: -109.0412 -112.5109 -122.1947
quadrupole: 7.8417 2.2024 -3.6874
quadrupole: 5.5411 2.0714 -7.6125 7.8417 2.2024 -3.6874
hfenergy: -1186.303213 hartree
pointgroup: C01 [X(C15H21N1O2S1)]
dipole: 0.0186874 -1.3590061 0.6936972 debye
polarizability: 221.7469023|-3.3414407|231.7023285|8.0922938|9.0809539|126.3385652 unknown
InChI: InChI=1S/C15H21NO2S/c1-16-6-7-18-14-9-11-10(8-12(14)16)13(17-2)4-5-15(11)19-3/h4-5,12,14H,6-9H2,1-3H3
charge 0 multiplicity 1
40 atoms
S  -2.810833 2.802441 -0.480678
O  2.508825 2.181091 -0.139156
O  -1.232596 -3.052035 -0.323672
N  3.230803 -0.619793 0.127784
C  1.824924 -0.173496 0.353337
C  1.545932 1.111069 -0.457004
C  0.817021 -1.2556 -0.08658
C  0.163301 1.67405 -0.123714
C  -0.613877 -0.74824 -0.210948
C  -0.940588 0.633846 -0.232007
C  4.189385 0.469289 0.44784
C  3.879423 1.713231 -0.394562
C  3.578432 -1.86429 0.846828
C  -1.658988 -1.710049 -0.337746
C  -2.307189 1.027057 -0.359101
C  -3.009148 -1.31923 -0.469143
C  -3.322677 0.057095 -0.474989
C  -2.256791 -4.091182 -0.447304
C  -2.615455 3.362215 1.317667
H  1.657581 0.072663 1.436335
H  1.628055 0.857147 -1.538491
H  0.824389 -2.109214 0.613647
H  1.151562 -1.665469 -1.061736
H  -0.065908 2.534239 -0.777858
H  0.212728 2.077009 0.90861
H  5.213743 0.116017 0.22098
H  4.154365 0.747431 1.532519
H  4.537629 2.555747 -0.123722
H  4.000536 1.474602 -1.472941
H  4.635457 -2.113925 0.644471
H  2.962483 -2.705004 0.488221
H  3.448194 -1.782454 1.955822
H  -3.810935 -2.056243 -0.56677
H  -4.362547 0.383071 -0.575497
H  -1.706607 -5.042988 -0.40981
H  -2.796951 -4.010458 -1.410498
H  -2.981529 -4.04539 0.388722
H  -1.555475 3.35648 1.613045
H  -3.20513 2.70666 1.975963
H  -3.007045 4.39111 1.359539
