program: Gaussian 09
title: 000128467
version: EM64L-G09RevD.01
frameworkgroup: C1[X(C12H7FN2O4)]
method: RPBEPBE
basis: SDD
operation: Freq
keyword: #p
keyword: freq=noraman
keyword: PBEPBE/SDD
title: #p freq=noraman PBEPBE/SDD
converged: YES YES NO NO
title: Mulliken charges:
elementType: F O O O O N N C C C C C C C C C C C C H H H H H H H
charge: -0.156319 -0.220451 -0.180631 -0.247229 -0.204588 -0.162646 -0.414449 -0.199662 0.330404 0.071856 0.123700 -0.388917 0.262748 -0.129538 -0.354562 -0.204469 -0.211900 0.173538 0.112068 0.305474 0.261450 0.293179 0.276718 0.243721 0.245782 0.374722
chargesum: 0.00000
title: Mulliken charges with hydrogens summed into heavy atoms:
elementType: F O O O O N N C C C C C C C C C C C C
charge: -0.156319 -0.220451 -0.180631 -0.247229 -0.204588 -0.162646 -0.039726 0.105812 0.330404 0.071856 0.123700 -0.127467 0.262748 0.163641 -0.077844 0.039252 0.033882 0.173538 0.112068
polarizability: 2.05932030e+02 -4.90475555e+00 1.28402766e+02 -1.32203743e+01 -5.48977665e+00 1.28756304e+02
1716.lowfreq: -10.9965 -3.0730 -0.0008 -0.0007 -0.0003 4.5892 26.9145 42.8995 50.8999
frequency: 26.8400 42.8711 50.8887 95.3590 132.4526 156.5219 185.1779 198.1901 218.1623 267.9278 287.7254 291.7607 364.3820 378.5684 408.2471 419.7563 446.5093 468.7844 516.9682 541.7746 568.8096 601.4359 618.8593 660.9702 686.9385 690.5878 701.9435 714.2347 733.0227 752.4113 761.3822 777.8287 788.0724 856.5273 872.2250 883.2863 891.6096 911.2281 957.7189 974.9976 1008.9574 1019.0035 1076.9930 1107.8910 1128.9657 1173.5693 1180.9833 1203.1756 1215.5953 1250.5151 1268.5894 1292.9061 1320.7225 1357.0260 1375.0420 1405.6636 1418.9951 1451.8074 1463.0363 1608.9673 1617.5163 1635.8346 1651.4102 1677.7563 1719.4294 3049.6462 3141.3206 3152.1738 3163.0118 3176.5902 3188.8091 3519.8055
redmass: 8.0415 8.3534 7.1682 11.4185 5.3613 9.7858 9.3991 8.1066 6.8213 7.6689 13.6981 8.0006 5.8478 11.0378 3.5008 4.2847 7.4615 6.1270 8.2442 7.5695 8.5593 5.9420 6.6233 5.0457 3.5859 3.6279 4.4646 9.6194 5.7668 7.5336 4.3982 2.0632 1.5742 6.5231 1.4325 2.0788 4.2145 2.2762 6.3519 1.4221 1.3423 2.1111 3.7544 2.4173 6.4428 1.1333 2.4092 4.0880 1.8217 2.3835 1.6646 1.5289 3.0086 1.9049 1.7067 7.8473 2.7709 2.4398 2.6069 7.5245 7.3183 6.1115 12.6662 6.6634 12.9782 1.0846 1.0870 1.0905 1.0956 1.1005 1.0940 1.0771
irintensity: 1.2267 1.7702 0.3284 0.5547 1.0816 4.8635 3.4486 1.5779 0.6511 1.0242 2.7084 11.8145 0.7264 14.2333 4.0887 4.6453 4.7607 2.2459 8.2177 6.3560 27.4758 2.4026 1.3324 11.6249 2.7537 18.9020 57.8590 3.7569 34.6086 4.2950 12.0795 115.4189 42.1600 159.4784 21.4869 73.3544 58.6547 20.6885 117.8947 3.9494 0.0529 0.6724 66.0331 29.3753 76.1482 13.1841 19.2035 53.3286 21.5135 214.0172 77.9202 18.7611 132.9609 47.6135 12.4998 2.1467 61.5573 15.6183 4.1161 6.3200 12.5686 308.6988 241.5697 482.4901 361.1910 32.1300 0.4953 4.6639 5.9649 14.4663 5.3068 78.8096
temp: 298.150 k
press: 1.00000 atm
elementType: 9 8 8 8 8 7 7 6 6 6 6 6 6 6 6 6 6 6 6 1 1 1 1 1 1 1
symmnumber: 1
zpe: 460111.7 jmol-1
zpe.correction: 0.175247 hartree
zpe.thermalcorrener: 0.190109 hartree
zpe.thermalcorrenthalpy: 0.191053 hartree
zpe.thermalcorrgfe: 0.131805 hartree
zpe.sumelectzpe: -970.419344 hartree
zpe.sumelectthermal: -970.404483 hartree
zpe.sumelectthermalent: -970.403539 hartree
zpe.sumelectthermalfe: -970.462787 hartree
dipole: -4.5364 3.8644 -3.6259
dipole: 6.9757
quadrupole: -114.1110 -115.4550 -114.3534
quadrupole: -19.4085 0.1501 -2.6872
quadrupole: 0.5288 -0.8152 0.2864 -19.4085 0.1501 -2.6872
hfenergy: -970.5945917 hartree
pointgroup: C01[X(C12H7F1N2O4)]
dipole: 1.7719861 -1.7310407 -1.181301 debye
dipolederiv: -0.2039908 -0.0334844 0.0444903 -0.2010852 -0.3327142 0.3523127 0.3158447 0.3633889 -0.6803743 -1.3430208 -0.0178906 -0.3042008 -0.0402433 -0.4912389 -0.0476524 -0.5365988 -0.1608624 -0.5037131 -0.6951393 -0.1554833 -0.2273776 -0.2009721 -0.7466673 -0.3643401 -0.4035747 -0.4026496 -0.6953863 -0.6251569 -0.0283786 0.034054 -0.0560617 -0.6089408 0.414875 0.0347493 0.4506812 -1.0449955 -1.3358554 -0.2290141 0.2174674 -0.1902498 -0.4090718 0.0928503 0.0900305 0.0706051 -0.4362212 -1.2574859 0.137543 -0.4048737 -0.3898062 -0.4414369 0.285268 0.6273938 0.406199 -0.7830776 -0.8754466 -0.2445083 0.3353056 -0.3234921 -0.5330161 0.2568278 0.4067081 0.2663282 -0.6935562 1.5320632 0.112241 -0.0064778 0.7115658 0.505765 0.1933497 -0.0967442 0.1554003 0.314036 -0.0646539 0.0274741 0.0494121 -0.241714 -0.0009417 -0.0104629 -0.0383562 0.0740362 -0.0131674 -0.1351606 0.0839922 0.0008363 0.1558979 -0.4220476 -0.2375951 0.0066155 -0.2478293 -0.1430313 1.4925903 0.0294854 0.5163035 -0.2208593 1.2083311 0.5386383 0.6731019 0.6621387 0.9488827 -0.0966253 0.1195183 0.1265116 0.1148737 -0.1423871 0.0369742 0.0978941 0.0597627 -0.0073652 1.3720433 0.00207 0.1531496 0.0408999 0.709093 -0.6487631 0.1005893 -0.6969277 1.4131022 0.3433984 0.0452068 -0.0242685 0.5204408 0.1542838 -0.1759743 -0.74846 -0.2379919 0.294199 0.02721 -0.0666276 0.0488669 0.0741957 0.0215156 0.1130075 0.1288684 0.029126 0.007673 0.0127163 -0.0469418 0.0416176 -0.0650686 0.0906711 0.1025053 0.0445474 0.1035414 -0.0209809 0.0313161 -0.1516393 0.0264924 -0.155264 -0.051629 -0.0407471 0.0100431 -0.0424409 -0.153443 -0.6188021 -0.0169845 -0.0681406 0.2193402 0.26721 -0.4064946 -0.5244125 -0.4336872 0.6785398 1.8050673 0.3262674 -0.2766377 0.2399077 0.5176257 -0.3299246 -0.072308 -0.3066619 0.7693513 0.1211398 0.0244818 -0.0333483 -0.0669863 0.0624168 -0.0258105 0.1159857 -0.049314 0.0696912 0.0437675 -0.0267266 -0.1020569 -0.0172594 0.0931459 -0.0299961 -0.0960384 -0.0458085 0.0667935 0.1063408 0.0100022 -0.0721728 0.0099083 0.1333477 0.0281998 -0.0630803 0.0482441 0.0950325 0.0570735 0.0016902 -0.0596221 -0.0234284 0.1043635 -0.0540031 -0.0831082 -0.0342434 0.0844105 0.0971477 0.0337487 -0.0080213 0.0488191 -0.0249047 -0.0980572 -0.00551 -0.0945717 0.0837284 -0.0129203 0.1003865 -0.0401636 0.1079832 0.0447061 -0.0122668 -0.0454125 -0.0092225 0.1255321 0.2223837 -0.0364289 0.0328546 -0.0513418 0.2925209 0.0672794 0.0612321 0.0727595 0.2243399 unknown
polarizability: 206.0812921|-2.9796202|130.1310491|13.3555385|5.248659|126.8787589 unknown
InChI: InChI=1S/C12H7FN2O4/c13-8-5-15(12(18)14-9(8)16)10-6-3-1-2-4-7(6)11(17)19-10/h1-5,10,14H
charge 0 multiplicity 1
26 atoms
F  -2.638635 -1.445959 2.278063
O  0.847972 1.890384 0.319752
O  2.670381 2.231222 1.758575
O  -1.754952 1.443272 -2.334997
O  -4.793494 -0.68318 0.530209
N  -0.905831 0.386846 -0.40197
N  -3.227961 0.366546 -0.865285
C  0.447177 0.87036 -0.698447
C  1.541114 -0.183562 -0.631737
C  2.519589 0.229326 0.29591
C  2.116156 1.52368 0.908279
C  1.681681 -1.386484 -1.34438
C  -1.9569 0.788666 -1.280016
C  -1.155931 -0.335768 0.768336
C  3.674691 -0.536945 0.546195
C  2.838385 -2.167322 -1.098011
C  3.824768 -1.74846 -0.166059
C  -2.421034 -0.71687 1.113593
C  -3.597047 -0.381529 0.297598
H  0.37939 1.383041 -1.674364
H  0.92822 -1.715549 -2.067493
H  -0.295171 -0.58261 1.39406
H  4.422308 -0.194376 1.268336
H  2.976054 -3.110194 -1.637827
H  4.708989 -2.372669 -0.001483
H  -4.001519 0.639435 -1.481338
