program: Gaussian 09
title: 000128460
version: EM64L-G09RevD.01
frameworkgroup: C1[X(C18H13F2NO4)]
method: RPBEPBE
basis: SDD
operation: Freq
keyword: #p
keyword: freq=noraman
keyword: PBEPBE/SDD
title: #p freq=noraman PBEPBE/SDD
converged: YES YES NO NO
title: Mulliken charges:
elementType: F F O O O O N C C C C C C C C C C C C C C C C C C H H H H H H H H H H H H H
charge: -0.194525 -0.180587 -0.217668 -0.382388 -0.284092 -0.425415 -0.155870 0.143285 0.234569 0.117338 -0.337864 0.027320 -0.318471 0.085581 -0.630544 0.102602 0.242438 0.373435 -0.664186 -0.342245 -0.342147 0.106387 -0.396296 -0.355523 0.287498 0.220056 0.256211 0.287309 0.314445 0.251132 0.230375 0.230022 0.252157 0.246526 0.225330 0.254963 0.379830 0.359011
chargesum: 0.00000
title: Mulliken charges with hydrogens summed into heavy atoms:
elementType: F F O O O O N C C C C C C C C C C C C C C C C C C
charge: -0.194525 -0.180587 -0.217668 -0.002558 -0.284092 -0.066404 -0.155870 0.143285 0.234569 0.117338 0.138403 0.027320 -0.031162 0.085581 -0.316099 0.102602 0.242438 0.373435 0.047343 -0.090088 -0.095620 0.106387 -0.170966 -0.100561 0.287498
polarizability: 4.10176325e+02 -1.11497408e+01 2.16311312e+02 -6.38139931e+00 -1.85563503e+01 1.15072330e+02
1716.lowfreq: -5.7189 -3.4000 0.0003 0.0006 0.0011 3.4152 19.6008 36.7255 38.1964
frequency: 19.5851 36.7241 38.1842 47.9860 56.9913 67.7248 92.9042 117.2521 140.0304 169.1914 170.3691 196.4230 202.1133 214.1072 239.1731 261.2310 280.0879 309.9173 336.1325 356.9554 365.5416 369.2926 379.4363 382.5807 389.2518 411.9839 415.8188 416.6057 479.1979 496.6031 511.6464 526.9755 542.3477 549.6472 593.2361 601.5079 622.0369 629.7822 646.2194 649.4541 705.9899 717.4058 725.7278 748.4482 780.5855 798.1682 802.5523 808.9565 815.3037 825.4443 840.4130 929.4645 943.0343 950.6390 955.1701 961.9726 965.4159 979.6213 1007.6714 1035.0142 1060.3313 1089.3040 1105.1104 1114.6006 1135.9115 1146.4705 1180.1148 1190.8409 1228.0242 1242.6778 1257.7596 1263.7294 1296.6350 1313.0554 1335.1031 1350.2576 1359.4008 1371.3190 1384.8721 1390.9910 1395.0402 1428.8256 1445.4238 1457.4235 1469.6041 1479.2655 1498.3123 1513.3639 1533.1359 1563.1502 1584.7926 1588.8463 1619.7950 1625.9082 1631.2961 2996.3693 3043.5794 3088.7877 3106.4779 3122.1375 3130.2952 3154.9801 3158.9435 3168.4558 3169.8389 3180.8468 3495.1329 3579.1372
redmass: 6.3907 10.7476 4.7424 8.8316 7.6063 5.1776 3.4232 5.4308 7.8928 8.0005 7.6963 3.6006 2.1444 2.2795 4.1486 8.7910 9.7062 5.5751 5.7297 7.2054 6.7955 4.6398 5.7903 1.1566 6.4943 3.0315 5.0024 6.7235 5.0487 4.2494 6.0838 4.1375 5.2489 3.6130 5.2289 1.7020 6.0473 5.4108 3.9493 4.4983 5.1032 5.2672 5.3284 6.3586 2.9422 5.7043 1.5512 1.4813 4.3415 4.1980 1.7693 1.4329 1.3626 2.4607 10.1638 1.4373 1.3556 7.7125 2.8002 3.5352 3.5987 2.0593 1.9715 1.6543 1.6174 1.3262 1.9617 1.1269 3.1056 3.0539 2.4173 1.5629 4.0775 1.4703 1.6594 1.6974 3.1013 7.1339 5.6808 3.1532 1.2140 3.6862 4.4254 4.6187 1.0709 1.0497 1.1236 3.0898 9.3796 8.6298 7.3798 6.4340 7.7845 7.2789 7.9338 1.0363 1.0673 1.1000 1.0972 1.0901 1.1006 1.0927 1.0883 1.0921 1.0947 1.0974 1.0636 1.0661
irintensity: 0.0354 2.2631 2.5888 1.3248 0.5272 0.8565 0.2414 1.6113 0.2314 1.3645 0.7579 0.0823 0.7963 0.1362 1.2312 5.2712 1.5708 3.3414 2.9495 2.1469 2.7927 15.5460 7.4881 142.2620 14.5176 2.0881 6.8620 6.4444 13.5707 11.3584 23.7194 3.6500 6.8810 16.8043 51.8998 81.1645 42.4752 7.2577 26.2405 9.2772 24.2667 16.9361 10.0020 0.8546 19.8445 26.2811 15.1055 24.0001 29.9310 11.5474 32.1231 22.0503 0.0974 2.5906 44.6375 10.8100 0.8753 48.9242 6.9705 80.4004 408.4879 16.8525 19.9859 74.9787 1.8314 275.1528 27.2611 38.5476 12.9706 12.8616 17.6498 83.3726 127.3683 43.8145 19.0795 36.4788 35.8279 43.2977 36.1447 13.2622 18.9316 23.3780 131.7487 155.5334 0.3264 12.9681 65.1880 34.6570 145.4113 87.6792 445.1834 47.5180 156.9896 192.5653 97.5115 15.4084 23.1527 17.4787 24.4151 21.4200 10.4359 3.0583 4.9120 13.1146 5.0339 4.1547 40.0472 75.5053
temp: 298.150 k
press: 1.00000 atm
elementType: 9 9 8 8 8 8 7 6 6 6 6 6 6 6 6 6 6 6 6 6 6 6 6 6 6 1 1 1 1 1 1 1 1 1 1 1 1 1
symmnumber: 1
zpe: 715815.0 jmol-1
zpe.correction: 0.272640 hartree
zpe.thermalcorrener: 0.294507 hartree
zpe.thermalcorrenthalpy: 0.295451 hartree
zpe.thermalcorrgfe: 0.220388 hartree
zpe.sumelectzpe: -1247.302116 hartree
zpe.sumelectthermal: -1247.280249 hartree
zpe.sumelectthermalent: -1247.279305 hartree
zpe.sumelectthermalfe: -1247.354368 hartree
dipole: -4.1393 4.2064 1.2783
dipole: 6.0384
quadrupole: -140.7453 -145.3822 -139.0493
quadrupole: 14.1096 -9.8887 -3.9294
quadrupole: 0.9803 -3.6566 2.6763 14.1096 -9.8887 -3.9294
hfenergy: -1247.5747556 hartree
pointgroup: C01 [X(C18H13F2N1O4)]
dipole: 1.6186447 1.7294284 -0.1814279 debye
polarizability: 409.8512048|13.6891938|204.7518632|-8.9328135|37.02586|126.9568994 unknown
InChI: InChI=1S/C18H13F2NO4/c1-2-21-8-12(18(24)25)17(23)11-7-13(19)14(15(20)16(11)21)9-3-5-10(22)6-4-9/h3-8,22,24H,2H2,1H3
charge 0 multiplicity 1
38 atoms
F  0.986915 1.843813 0.48655
F  1.695486 -2.780981 -0.70951
O  -3.281685 -2.427294 -0.546066
O  -5.843161 -1.38553 -0.161203
O  -6.002392 0.852265 0.404994
O  7.051697 0.471785 0.044562
N  -1.904829 1.41795 0.451864
C  -0.960517 0.395059 0.162685
C  -1.450591 -0.90887 -0.176159
C  0.454087 0.565597 0.188128
C  -1.542878 2.851834 0.716638
C  1.396683 -0.444957 -0.105945
C  -3.24332 1.121186 0.398964
C  -2.916423 -1.250123 -0.234217
C  -0.540071 -1.949841 -0.471024
C  -3.796823 -0.120608 0.092557
C  0.827022 -1.7081 -0.435361
C  2.865805 -0.209729 -0.078334
C  -1.262032 3.639124 -0.576535
C  3.69686 -0.734632 -1.104398
C  3.479279 0.531285 0.971182
C  -5.280618 -0.149311 0.130602
C  5.088414 -0.520307 -1.093624
C  4.867914 0.743685 0.997966
C  5.675316 0.22014 -0.038666
H  -2.403339 3.291141 1.249543
H  -0.679841 2.887147 1.394864
H  -3.930381 1.943532 0.62259
H  -0.950259 -2.934719 -0.713685
H  -0.391264 3.23116 -1.115044
H  -2.137193 3.623584 -1.24991
H  -1.040128 4.691667 -0.324917
H  3.254701 -1.309675 -1.922796
H  2.866817 0.934621 1.782406
H  5.709682 -0.930066 -1.900116
H  5.342386 1.304829 1.807778
H  -6.834335 -1.290871 -0.105894
H  7.537116 0.061811 -0.714068
