program: Gaussian 09
title: 000128448
version: EM64L-G09RevD.01
frameworkgroup: C1[X(C22H14O7)]
method: RPBEPBE
basis: SDD
operation: Freq
keyword: #pfreq=noraman
keyword: PBEPBE/SDD
title: #p freq=noraman PBEPBE/SDD
converged: YES YES NO NO
title: Mulliken charges:
elementType: O O O O O O O C C C C C C C C C C C C C C C C C C C C C C H H H H H H H H H H H H H H
charge: -0.284195 -0.290222 -0.244093 -0.233398 -0.319376 -0.179820 -0.381702 0.201219 -0.197133 -0.400177 -0.362394 0.329964 -0.435890 0.064461 0.070535 0.132751 0.182943 0.418109 0.280288 -0.702299 0.038726 -0.285381 0.036569 0.334852 -0.795273 0.126732 -0.413506 -0.350129 -0.190568 0.320159 0.234078 0.271627 0.227867 0.248278 0.298505 0.301462 0.227692 0.260733 0.260865 0.294745 0.267716 0.245422 0.389256
chargesum: 0.00000
title: Mulliken charges with hydrogens summed into heavy atoms:
elementType: O O O O O O O C C C C C C C C C C C C C C C C C C C C C C
charge: -0.284195 -0.290222 -0.244093 -0.233398 -0.319376 -0.179820 0.007553 0.201219 0.123027 0.105527 0.113751 0.329964 -0.137385 0.064461 0.070535 0.132751 0.182943 0.418109 0.280288 -0.400837 0.038726 -0.285381 0.036569 0.334852 -0.045983 0.126732 -0.118761 -0.082412 0.054854
polarizability: 3.95215411e+02 -4.06597756e+01 3.61545162e+02 2.95927918e+00 5.44831800e+00 1.27804862e+02
1716.lowfreq: -6.2550 -0.0010 -0.0009 -0.0009 3.9695 5.9921 25.9168 27.9427 42.6566
frequency: 25.8754 27.9382 42.6557 56.2925 63.5245 74.3600 98.2948 121.4432 131.6192 147.7517 159.9215 187.5589 196.1440 207.9552 228.3193 231.8119 239.0630 256.2777 269.0954 279.4983 308.7370 318.9419 327.6614 341.5518 376.0005 414.8033 423.0873 431.2575 440.0229 465.7483 483.3113 495.2898 496.2418 512.9158 550.8318 560.6394 577.3362 583.0488 589.3874 635.4343 640.1130 654.7131 663.3740 679.5748 714.2887 720.3255 740.6560 753.9617 777.3388 779.8737 811.1068 812.2683 823.5053 832.3330 865.3148 875.2305 894.3960 900.9192 930.5332 931.7762 953.3280 955.8083 966.0290 996.9841 1001.2421 1007.7307 1020.9357 1034.5674 1044.9961 1052.4020 1057.3125 1071.2309 1084.1515 1114.2552 1126.9895 1132.4536 1139.5578 1174.4734 1206.9032 1218.9406 1230.7741 1236.1781 1242.8385 1267.1199 1293.3464 1302.2162 1313.9813 1324.1716 1338.3024 1379.1124 1385.3826 1388.9943 1405.3017 1414.2675 1432.6612 1444.3452 1444.6304 1446.3087 1455.8317 1459.1497 1463.9885 1518.5670 1541.5872 1551.6823 1566.7794 1575.9572 1600.0533 1623.0538 1642.0560 2731.0573 2996.2234 3074.6604 3077.8471 3079.4653 3100.4160 3120.6111 3148.7829 3155.5188 3169.9809 3181.7514 3191.8134 3194.8479 3197.4166
redmass: 5.1702 8.0515 7.5463 4.7278 6.8642 5.6031 5.8400 6.4110 6.5798 6.4737 4.2834 2.1334 1.7229 5.0372 5.8273 4.9534 5.0583 6.7231 4.3728 6.0470 5.3837 4.9402 6.3671 8.0725 7.8177 5.0080 8.3059 8.4309 5.1484 9.4817 4.8017 6.7180 7.5641 5.0790 7.4995 5.1658 6.1914 4.7574 5.1817 5.6214 7.5138 4.4492 5.5854 7.1833 3.4233 6.6842 6.0685 6.9463 3.4940 5.3656 2.9126 2.3473 6.2574 4.4860 3.2843 4.7479 2.9048 1.5710 5.1071 1.3619 1.5523 1.1275 2.6968 3.2352 1.3760 1.9180 1.5411 1.3755 1.6196 2.2984 1.5632 2.4947 2.4589 1.3474 1.8951 1.7612 1.3462 1.1853 1.9382 2.9004 1.7929 1.9971 2.4441 2.7108 3.5957 4.5242 5.9054 4.2414 5.3107 7.5426 3.1346 2.0486 1.5042 5.8169 3.0942 1.0465 3.3001 1.1781 4.2837 1.2641 1.2241 6.5981 4.1467 9.4401 7.8534 4.4615 7.2821 6.1666 8.4220 1.0701 1.0367 1.0519 1.0944 1.0520 1.1023 1.0919 1.0879 1.0917 1.0929 1.0983 1.0928 1.1200 1.1205
irintensity: 0.0132 0.0976 0.4005 0.9147 1.7181 8.8319 2.4822 1.7432 2.1796 0.8196 0.9280 1.1552 1.2151 2.0193 5.3294 0.8919 0.0329 0.5091 5.9154 3.4761 6.2675 1.2769 0.3713 2.9797 7.9964 7.3401 20.2198 3.5153 0.2625 2.9678 13.0750 9.5164 2.9857 2.0199 1.2835 0.9932 2.8196 5.1938 11.1871 14.4887 5.0479 3.3826 9.3992 1.9155 11.0937 0.9951 9.0181 7.3442 9.6803 18.5178 61.1359 25.5051 2.8652 41.9048 3.5492 25.8507 35.1572 20.7942 0.9634 4.5876 1.5335 117.2025 4.6948 43.0513 1.6842 10.2465 2.5851 2.0345 13.6199 7.7797 12.1649 50.5793 28.9354 9.3602 16.2551 3.2886 5.7381 10.5626 3.3013 14.3979 63.5698 72.7142 1.8760 177.8940 120.6631 247.9904 211.4698 412.6580 121.8886 34.3724 15.4861 2.8314 34.9883 18.0100 8.6496 14.0221 183.1035 9.4951 150.9478 34.9656 4.0699 48.0154 25.3254 292.9767 30.3838 86.6739 82.8000 29.0003 231.4262 206.1519 7.3291 16.7063 3.4999 21.7454 30.6509 11.6248 9.4455 3.6179 0.6493 11.6321 3.4217 10.5323 2.1633
temp: 298.150 k
press: 1.00000 atm
elementType: 8 8 8 8 8 8 8 6 6 6 6 6 6 6 6 6 6 6 6 6 6 6 6 6 6 6 6 6 6 1 1 1 1 1 1 1 1 1 1 1 1 1 1
symmnumber: 1
zpe: 802984.8 jmol-1
zpe.correction: 0.305841 hartree
zpe.thermalcorrener: 0.329429 hartree
zpe.thermalcorrenthalpy: 0.330373 hartree
zpe.thermalcorrgfe: 0.252303 hartree
zpe.sumelectzpe: -1371.232895 hartree
zpe.sumelectthermal: -1371.209306 hartree
zpe.sumelectthermalent: -1371.208362 hartree
zpe.sumelectthermalfe: -1371.286432 hartree
dipole: 2.7780 -0.2628 -0.1762
dipole: 2.7959
quadrupole: -166.4769 -183.0328 -158.9970
quadrupole: -5.0089 2.2593 -3.6931
quadrupole: 3.0254 -13.5305 10.5052 -5.0089 2.2593 -3.6931
hfenergy: -1371.5387353 hartree
pointgroup: C01 [X(C22H14O7)]
dipole: -1.0812413 0.0524375 -0.1954031 debye
polarizability: 394.9007236|-35.9056088|354.9731624|30.4482414|-32.4080894|134.6915485 unknown
InChI: InChI=1S/C22H14O7/c1-9-5-11-18(20(26)17-10(19(11)25)3-2-4-12(17)23)21-16(9)13(24)6-14(29-21)22(8-28-22)15-7-27-15/h2-6,15,23H,7-8H2,1H3
charge 0 multiplicity 1
43 atoms
O  5.139186 1.121056 0.244756
O  3.673389 3.76448 0.022962
O  1.568023 0.121791 -0.098379
O  3.144513 -3.629424 0.722864
O  -0.441113 1.788128 -0.347917
O  -3.885535 -2.532072 -0.208081
O  -2.347249 3.357817 -0.804661
C  3.681485 1.224342 -0.101983
C  2.960715 2.480975 0.339916
C  4.725427 1.319747 -1.191004
C  3.511702 3.311782 1.459053
C  2.940338 -0.063581 0.080745
C  3.473625 -1.286702 0.377628
C  0.680703 -0.949262 0.028102
C  1.161683 -2.268242 0.292587
C  2.635789 -2.484436 0.481918
C  -0.703483 -0.631987 -0.133687
C  0.210154 -3.342003 0.372031
C  -1.615987 -1.72722 -0.06757
C  -1.153759 -3.03825 0.177142
C  -1.217272 0.745145 -0.345121
C  -3.094997 -1.537464 -0.260139
C  -2.66208 0.935443 -0.545967
C  -3.585473 -0.15695 -0.515939
C  0.602504 -4.775162 0.649754
C  -3.169746 2.26337 -0.775829
C  -4.962473 0.060445 -0.716489
C  -4.562891 2.466301 -0.981876
C  -5.444072 1.373658 -0.952087
H  1.884319 2.485363 0.129699
H  4.899192 0.455382 -1.842811
H  4.944939 2.318151 -1.584771
H  2.828838 3.924333 2.058803
H  4.44803 2.993653 1.930687
H  4.549532 -1.380224 0.540209
H  -1.904694 -3.83341 0.217214
H  -0.291669 -5.420277 0.66142
H  1.318059 -5.151608 -0.101596
H  1.134814 -4.867915 1.61234
H  -5.637019 -0.799817 -0.683339
H  -4.913249 3.487154 -1.158211
H  -6.514509 1.540623 -1.109898
H  -1.384691 3.00877 -0.627973
