program: Gaussian 09
title: 000128485
version: EM64L-G09RevD.01
frameworkgroup: C1[X(C24H22N6O5S2)]
method: RPBEPBE
basis: SDD
operation: Freq
keyword: #p
keyword: freq=noraman
keyword: PBEPBE/SDD
title: #p freq=noraman PBEPBE/SDD
converged: YES YES NO NO
title: Mulliken charges:
elementType: S S O O O O O N N N N N N C C C C C C C C C C C C C C C C C C C C C C C C H H H H H H H H H H H H H H H H H H H H H H
charge: 0.203403 0.165248 -0.162500 -0.388987 -0.246215 -0.161661 -0.207942 -0.173821 -0.073345 -0.125860 -0.019149 -0.016882 -0.346856 -0.482124 -0.302460 0.145732 0.172574 0.438050 -0.808810 -0.853946 0.116505 0.132584 -0.334138 -0.292250 -0.112263 -0.183174 -0.106530 -0.526577 0.488658 -0.633590 -0.441973 -0.357788 -0.039370 0.148564 -0.213809 -0.224582 -0.238291 0.323705 0.258152 0.277320 0.325268 0.352060 0.344046 0.257674 0.250993 0.259060 0.238361 0.389938 0.245842 0.224301 0.346785 0.275601 0.249240 0.259929 0.235602 0.248575 0.233052 0.232792 0.235285
chargesum: 0.00000
title: Mulliken charges with hydrogens summed into heavy atoms:
elementType: S S O O O O O N N N N N N C C C C C C C C C C C C C C C C C C C C C C C C
charge: 0.203403 0.165248 -0.162500 0.000950 -0.246215 -0.161661 -0.207942 -0.173821 -0.073345 -0.125860 -0.019149 -0.016882 -0.000071 -0.158419 -0.044308 0.145732 0.172574 0.438050 -0.206222 -0.157841 0.116505 0.132584 -0.076464 -0.041258 0.146797 0.055188 -0.106530 -0.056434 0.488658 0.151179 -0.206372 -0.109213 -0.039370 0.148564 0.019243 0.008209 -0.003007
polarizability: 5.10612297e+02 -2.38300757e+01 3.81424066e+02 5.40818414e+00 1.44500752e+01 2.96107522e+02
1716.lowfreq: -6.0843 -2.1723 -0.0018 -0.0016 -0.0008 3.5450 6.9500 12.3831 17.8509
frequency: 4.8301 11.6301 17.8323 20.4822 23.2464 24.5167 32.9330 38.4794 43.3281 55.2184 66.1323 75.0512 84.0970 95.0189 96.9006 102.8739 113.3868 122.7467 127.8251 140.9165 160.6950 175.5392 185.0437 199.0946 228.9389 241.1335 247.9374 254.5569 270.2914 300.8382 309.6938 318.9185 325.4116 335.1745 350.7025 367.7959 377.2851 382.4800 398.4817 403.5708 414.5641 423.7936 437.0601 447.1049 455.7512 470.0853 481.7653 488.1757 520.1315 538.4419 564.1949 575.0221 576.5168 587.4941 599.0086 599.6667 608.8996 615.9663 622.0846 639.7304 647.3100 651.2410 690.3777 696.6435 703.0236 708.7246 736.1591 739.6048 744.3990 757.7700 783.3851 795.2362 797.3527 810.8624 812.9070 823.4926 832.3446 856.4946 859.4310 877.8655 913.4680 915.2772 935.1607 957.5405 961.2259 961.5203 974.6185 981.0302 990.7125 995.4392 1002.0103 1005.3917 1016.6579 1026.5533 1043.2924 1057.7709 1063.9737 1085.3459 1093.0038 1101.8853 1107.7337 1118.4981 1141.4229 1161.9341 1175.1648 1177.4026 1179.3318 1181.0164 1189.8408 1190.2603 1209.1757 1220.6970 1222.7916 1224.3357 1240.8565 1252.0425 1255.6175 1277.1595 1283.5752 1294.5909 1306.3507 1308.7842 1344.9492 1349.5344 1380.0164 1384.6189 1389.3663 1407.3849 1413.1726 1428.5884 1442.9868 1444.1311 1446.5313 1449.5913 1468.2583 1474.4231 1477.8904 1487.0315 1537.5953 1541.8851 1560.0191 1596.9334 1597.6191 1610.6496 1615.4824 1627.6665 1635.3052 1662.7225 1736.9761 2919.5128 2983.3507 2986.7909 3004.1253 3009.0463 3043.2792 3070.5714 3071.6977 3077.4081 3117.8327 3118.0201 3126.3111 3138.4832 3142.8868 3147.4200 3150.5820 3166.8950 3167.4838 3170.8256 3191.3438 3522.6395 3527.7171
redmass: 7.1445 8.2520 5.9766 4.4202 5.1883 7.4765 6.7220 7.6731 6.9855 5.9798 9.1850 4.7032 7.4575 2.3537 4.5973 4.2492 2.6195 5.5719 5.9889 5.1161 4.9263 8.1189 5.3992 5.7520 5.2255 5.0805 6.7645 6.3643 8.3830 6.2529 3.8804 5.6073 7.5096 3.9907 3.2310 5.2912 2.8330 4.6025 6.3229 2.8237 4.5781 3.4420 3.4853 8.3089 4.1017 4.2197 4.2038 3.6025 4.2194 2.7396 4.0750 2.8781 3.4370 6.8654 4.6726 5.4312 2.7980 6.3358 6.0922 5.0073 9.1346 5.0080 5.4178 3.5890 2.5549 3.5579 4.8113 3.6785 2.4721 12.2683 2.1619 3.1688 2.4804 7.1271 4.2572 1.9185 4.7828 1.2485 1.8504 2.7985 1.4285 2.8058 1.3106 4.3601 1.8077 2.6590 1.8883 1.3977 6.1161 2.8668 1.3521 3.2410 5.9217 2.2239 6.4780 3.8392 2.5471 1.5994 2.4471 1.5854 2.6490 1.3237 1.2757 1.3321 1.0763 4.6523 2.8740 1.3625 1.3429 1.1808 1.3476 1.2536 2.3119 1.2238 1.4471 2.1635 1.5722 1.5840 2.1279 1.7425 2.1102 1.4196 3.5526 1.3774 6.1915 2.4156 2.4985 2.0676 1.5652 1.1207 1.4776 2.4367 3.1173 1.2166 1.0528 1.2697 1.1690 1.9677 3.1166 5.4402 6.6383 6.1723 7.2352 12.6575 6.0128 8.8492 7.1675 6.0588 12.8535 1.0816 1.0347 1.0612 1.0605 1.0658 1.1015 1.1034 1.0886 1.1017 1.0882 1.0987 1.0866 1.0908 1.0997 1.0874 1.0959 1.0882 1.1014 1.0977 1.0996 1.0796 1.0644
irintensity: 0.9999 3.4361 0.8332 2.0619 3.2369 1.2325 0.3782 1.8338 0.0782 1.5154 1.2484 1.8548 1.6433 1.2978 2.4213 1.1520 0.0745 1.5237 1.2086 0.4460 1.3810 0.3624 0.8224 3.7420 1.6546 1.8625 0.7601 0.9780 4.3566 2.1195 9.3678 4.8592 3.3265 0.5067 1.5873 9.3022 5.7038 0.1017 5.6458 0.4796 7.8709 0.9764 25.2980 3.8627 15.6277 4.6810 9.3653 7.3262 18.3230 80.0843 4.8828 64.1339 57.2114 86.8730 3.5215 45.0719 66.2445 0.3065 14.6113 27.8488 1.8174 24.7748 19.3681 6.4318 48.8928 6.2534 37.3341 17.9245 27.8089 0.0222 6.6770 20.7245 1.4421 20.3348 1.7870 63.4855 3.7215 0.0585 10.1472 20.0437 4.0877 1.2868 0.4587 18.3562 36.5746 48.9698 6.5851 0.0252 2.3795 41.2087 2.3070 22.9692 294.4442 10.9031 72.7371 229.6047 45.1362 12.9299 37.5571 6.1909 145.5403 10.1048 2.2349 16.7666 5.1510 114.6088 212.7570 30.9306 8.5387 1.0413 64.3850 8.1717 47.6407 3.3221 9.6884 6.4786 73.1504 1.0347 26.7840 16.8411 92.5255 6.1516 178.8750 18.2889 373.3422 23.8883 53.5678 106.5011 79.5832 25.6954 87.0579 28.5981 21.3880 34.2010 30.9499 32.5263 145.0743 7.4140 242.4354 161.4176 135.6257 18.0855 139.4753 134.2942 3.0500 213.2229 416.6750 465.2420 565.8252 52.7986 54.2537 51.2975 10.8091 12.5033 11.2519 16.1465 13.9042 12.7074 7.9976 3.1431 4.0524 8.1034 45.5821 4.0363 33.2312 1.2807 21.8955 6.8977 5.2143 45.8191 66.3108
temp: 298.150 k
press: 1.00000 atm
elementType: 16 16 8 8 8 8 8 7 7 7 7 7 7 6 6 6 6 6 6 6 6 6 6 6 6 6 6 6 6 6 6 6 6 6 6 6 6 1 1 1 1 1 1 1 1 1 1 1 1 1 1 1 1 1 1 1 1 1 1
symmnumber: 1
zpe: 1132188.4 jmol-1
zpe.correction: 0.431228 hartree
zpe.thermalcorrener: 0.466176 hartree
zpe.thermalcorrenthalpy: 0.467120 hartree
zpe.thermalcorrgfe: 0.356272 hartree
zpe.sumelectzpe: -2425.772812 hartree
zpe.sumelectthermal: -2425.737864 hartree
zpe.sumelectthermalent: -2425.736920 hartree
zpe.sumelectthermalfe: -2425.847768 hartree
dipole: -6.2209 -5.8104 8.5836
dipole: 12.0888
quadrupole: -156.9840 -260.4728 -226.9429
quadrupole: 20.2244 62.2251 -23.5435
quadrupole: 57.8159 -45.6729 -12.1430 20.2244 62.2251 -23.5435
hfenergy: -2426.2040401 hartree
pointgroup: C01 [X(C24H22N6O5S2)]
dipole: -2.0503362 2.6267351 -3.3936715 debye
polarizability: 514.0613755|9.2189846|376.9408807|5.7970224|17.7043569|297.1416287 unknown
InChI: InChI=1S/C24H22N6O5S2/c1-28-24(26-19(31)20(32)27-28)37-13-15-12-36-22-17(21(33)30(22)18(15)23(34)35)25-16-7-9-29(10-8-16)11-14-5-3-2-4-6-14/h2-10,17,22,27,34H,11-13H2,1H3
charge 0 multiplicity 1
59 atoms
S  0.608508 -0.5887 1.697873
S  4.982791 -0.817206 -1.227599
O  -0.592428 -4.929795 0.468871
O  1.552457 -4.738016 -1.583076
O  3.508179 -4.800081 -0.334575
O  5.780282 1.558076 3.207292
O  7.385245 3.616832 1.89737
N  0.534879 -2.802945 0.017567
N  -2.687868 -2.395056 -0.025857
N  -5.609738 0.52079 0.862009
N  6.556552 1.37903 -0.841629
N  5.463836 0.556375 1.113442
N  7.070949 2.446554 -0.064446
C  -0.23441 -1.577291 0.320864
C  -1.459376 -2.485445 0.743999
C  -0.531917 -3.696373 0.397191
C  1.93025 -2.918062 -0.096588
C  2.76884 -1.872264 0.255401
C  2.252533 -0.528872 0.748307
C  4.261997 -1.967996 0.160521
C  2.433441 -4.225042 -0.634505
C  -3.559185 -1.437126 0.300319
C  -4.825639 -1.373903 -0.43151
C  -3.411272 -0.394094 1.328878
C  -5.788984 -0.436488 -0.145692
C  -4.414212 0.520215 1.574638
C  5.73085 0.496624 -0.1819
C  -6.705918 1.465721 1.193263
C  -7.168757 2.316788 0.013434
C  6.954509 1.366875 -2.257476
C  -8.551879 2.528841 -0.20214
C  -6.23085 2.938823 -0.848772
C  6.000345 1.537862 1.973166
C  6.873337 2.628356 1.316796
C  -8.995062 3.359611 -1.256792
C  -6.671854 3.764609 -1.905086
C  -8.055422 3.98021 -2.110566
H  -0.400967 -0.931124 -0.554598
H  -1.602052 -2.448217 1.848435
H  2.114332 0.16801 -0.098828
H  2.987813 -0.075026 1.434287
H  4.635267 -2.969864 -0.083936
H  4.745546 -1.568577 1.070459
H  -4.993549 -2.111711 -1.220104
H  -2.489346 -0.312288 1.912003
H  -6.735999 -0.380635 -0.688174
H  -4.316067 1.295504 2.3407
H  1.842831 -5.652923 -1.845088
H  -7.565681 0.900429 1.602903
H  -6.331295 2.117266 2.004681
H  7.63657 3.136758 -0.56742
H  6.678162 0.396499 -2.696247
H  8.050643 1.482866 -2.336976
H  6.448772 2.172542 -2.820678
H  -9.285796 2.04462 0.454594
H  -5.158213 2.767451 -0.699101
H  -10.067742 3.516505 -1.414283
H  -5.939724 4.239177 -2.567634
H  -8.396413 4.621299 -2.930789
