program: Gaussian 09
title: 000128328
version: EM64L-G09RevD.01
frameworkgroup: C1[X(C9H18N2O2)]
method: RPBEPBE
basis: SDD
operation: Freq
keyword: #p
keyword: freq=noraman
keyword: PBEPBE/SDD
title: #p freq=noraman PBEPBE/SDD
converged: YES YES NO NO
title: Mulliken charges:
elementType: O O N N C C C C C C C C C H H H H H H H H H H H H H H H H H H
charge: -0.287731 -0.287729 -0.133650 -0.133637 -0.348002 -0.400080 -0.400086 -0.007870 -0.007871 -0.230466 -0.230470 -0.697459 -0.697457 0.204367 0.204362 0.235291 0.186682 0.235295 0.186680 0.217398 0.217399 0.233644 0.189923 0.233648 0.189916 0.204352 0.239199 0.220401 0.220400 0.204352 0.239199
chargesum: 0.00000
title: Mulliken charges with hydrogens summed into heavy atoms:
elementType: O O N N C C C C C C C C C
charge: -0.287731 -0.287729 -0.133650 -0.133637 0.060726 0.021893 0.021888 0.209529 0.209528 0.193101 0.193094 -0.033507 -0.033506
polarizability: 1.51263474e+02 2.52980486e-04 9.84510395e+01 9.17051867e+00 -2.18048464e-05 9.90496064e+01
1716.lowfreq: -35.6462 -11.0133 -8.9825 0.0005 0.0006 0.0007 1.8555 13.8180 36.1325
frequency: -32.9460 -2.6841 34.8660 51.1187 74.9565 123.8332 138.1326 203.1125 204.2518 241.9350 262.4085 278.8225 329.8846 350.0986 361.3589 444.1732 456.2569 571.2141 599.9379 636.3109 662.3147 779.9133 780.6634 849.2779 863.0029 894.9246 895.0562 938.9099 941.4107 984.0721 985.7922 1006.8559 1051.8540 1057.7687 1069.7709 1070.1998 1094.2130 1112.4519 1121.1638 1127.5828 1140.2230 1143.3738 1162.3283 1167.6352 1168.7301 1192.2796 1214.1896 1220.0314 1265.5462 1284.7228 1296.9289 1298.9004 1310.8344 1351.3762 1359.3471 1359.3978 1365.3155 1389.5386 1389.8170 1402.1989 1460.0010 1460.0118 1464.1425 1471.6367 1473.9160 1476.9324 1477.4548 1498.9256 1505.3616 2828.5871 2865.4660 2867.3550 2868.5423 2880.7551 2884.7383 2978.0181 2978.1808 2988.4683 2988.5718 3036.9462 3038.7891 3048.2713 3048.6896 3085.4295 3085.4771 3098.7069 3098.7510
redmass: 2.6752 4.1041 3.5948 3.6065 2.5708 2.9949 2.8650 1.1402 1.0588 2.8592 2.5250 3.0976 2.6133 2.9806 2.1639 2.3840 2.2444 3.3803 3.9487 5.8385 5.8357 3.5337 3.5429 4.5087 3.8099 1.9763 1.9936 1.5391 1.5105 2.9022 3.2063 2.1119 2.1504 2.1175 1.6337 1.6893 1.5646 1.4282 1.5579 1.5547 1.6481 1.6601 2.0570 2.2722 2.0214 2.4678 1.9535 2.3353 1.2814 1.3030 1.2119 1.1713 1.4726 1.2894 1.3519 1.5411 1.5590 1.2870 1.2750 1.3614 1.0590 1.0568 1.0844 1.0790 1.0641 1.0560 1.0622 1.0905 1.0896 1.0534 1.0718 1.0996 1.0697 1.0704 1.0738 1.0846 1.0847 1.0365 1.0365 1.0926 1.0911 1.0921 1.0923 1.0988 1.0988 1.1003 1.1002
irintensity: 2.6216 11.3052 0.1078 0.6601 2.9924 1.3688 0.1551 0.0151 0.3135 0.5625 1.3934 3.2232 12.1307 6.2304 7.0447 3.0262 0.9085 0.4125 0.5356 9.1083 0.0826 14.2724 9.1699 3.6319 32.7130 0.3386 0.0151 52.1533 2.6341 106.1434 1.8935 15.4241 6.4199 45.5727 12.2148 16.7956 4.3907 17.5316 4.4697 6.9927 5.9880 2.9026 43.4687 36.0977 0.9199 160.4709 0.1101 65.8951 2.9297 13.9466 5.0586 32.4437 1.9015 30.6192 3.1732 0.6629 0.4256 58.3479 5.5332 32.2577 8.0948 2.4002 2.4935 5.4779 6.4842 21.1650 3.6330 0.3026 2.2873 56.0822 78.2872 41.2923 114.7177 49.7908 249.8280 34.1777 62.3215 44.2209 5.2267 69.4287 38.8424 0.3649 47.4382 1.3987 68.0821 21.2040 44.4999
temp: 298.150 k
press: 1.00000 atm
elementType: 8 8 7 7 6 6 6 6 6 6 6 6 6 1 1 1 1 1 1 1 1 1 1 1 1 1 1 1 1 1 1
symmnumber: 1
zpe: 700358.0 jmol-1
zpe.correction: 0.266752 hartree
zpe.thermalcorrener: 0.279311 hartree
zpe.thermalcorrenthalpy: 0.280255 hartree
zpe.thermalcorrgfe: 0.226944 hartree
zpe.sumelectzpe: -612.582581 hartree
zpe.sumelectthermal: -612.570022 hartree
zpe.sumelectthermalent: -612.569078 hartree
zpe.sumelectthermalfe: -612.622389 hartree
dipole: 0.0001 3.5425 -0.0002
dipole: 3.5425
quadrupole: -79.4373 -81.1133 -80.0828
quadrupole: 0.0006 10.5230 0.0000
quadrupole: 0.7738 -0.9021 0.1283 0.0006 10.5230 0.0000
hfenergy: -612.8493333 hartree
pointgroup: C01 [X(C9H18N2O2)]
dipole: -0.0000645 -1.3937173 -0.0003987 debye
polarizability: 151.1986576|0.0010203|98.4510395|-9.3529943|0.0001192|99.1144224 unknown
InChI: InChI=1S/C9H18N2O2/c1-8-3-10(6-12-8)5-11-4-9(2)13-7-11/h8-9H,3-7H2,1-2H3
charge 0 multiplicity 1
31 atoms
O  2.988198 0.92188 0.812256
O  -2.988116 0.922518 -0.811975
N  1.179074 -0.198995 -0.205843
N  -1.179126 -0.199003 0.205653
C  -0.000054 -1.046263 -0.000293
C  2.420636 -0.891214 -0.626023
C  -2.420759 -0.891379 0.625385
C  3.476901 0.21084 -0.408432
C  -3.476962 0.210831 0.408277
C  1.550994 0.644915 0.962381
C  -1.550939 0.645477 -0.962196
C  4.903906 -0.269094 -0.151077
C  -4.903959 -0.268922 0.150532
H  0.097129 -1.708082 0.898528
H  -0.097293 -1.707642 -0.899431
H  2.355032 -1.211886 -1.680334
H  2.662738 -1.780634 0.008255
H  -2.355247 -1.212595 1.679536
H  -2.662844 -1.78046 -0.009375
H  3.447097 0.924581 -1.257055
H  -3.447223 0.924119 1.257283
H  0.977403 1.587878 0.964629
H  1.397278 0.115875 1.934316
H  -0.977263 1.588387 -0.96401
H  -1.397246 0.116855 -1.934365
H  5.311983 -0.775722 -1.045416
H  5.555813 0.588604 0.087547
H  4.930189 -0.970654 0.701132
H  -4.93019 -0.970022 -0.702058
H  -5.312133 -0.776019 1.044561
H  -5.555818 0.588925 -0.087686
