program: Gaussian 09
title: 000128317
version: EM64L-G09RevD.01
frameworkgroup: C1[X(C9H21N3O)]
method: RPBEPBE
basis: SDD
operation: Freq
keyword: #p
keyword: freq=noraman
keyword: PBEPBE/SDD
title: #p freq=noraman PBEPBE/SDD
converged: YES YES NO NO
title: Mulliken charges:
elementType: O N N N C C C C C C C C C H H H H H H H H H H H H H H H H H H H H H
charge: -0.292393 -0.099676 -0.570740 -0.568597 -0.387915 -0.358102 -0.386705 -0.338476 -0.340102 -0.400406 0.215458 -0.372428 -0.796320 0.256415 0.199259 0.179355 0.233947 0.212590 0.223082 0.175077 0.226573 0.195365 0.224857 0.214485 0.176923 0.204956 0.176554 0.266259 0.227889 0.232754 0.257527 0.273280 0.262744 0.276510
chargesum: 0.00000
title: Mulliken charges with hydrogens summed into heavy atoms:
elementType: O N N N C C C C C C C C C
charge: -0.292393 -0.099676 -0.039932 -0.029344 0.067759 0.055200 0.048967 0.063175 0.080120 -0.008998 0.215458 0.009083 -0.069419
polarizability: 1.42659798e+02 1.71956453e+00 1.28421685e+02 -3.59290165e+00 -5.59018556e-01 9.81878536e+01
1716.lowfreq: -15.5564 -5.8957 -0.0006 -0.0004 -0.0002 5.7813 24.0109 42.6948 54.5857
frequency: 23.6150 42.4202 54.4792 60.8534 68.4567 84.0020 94.4078 122.9082 135.9910 143.7691 147.9791 190.9152 228.0254 241.0533 250.0533 284.5246 347.1107 377.9276 386.6375 441.4776 459.8084 516.5861 572.7154 586.0861 589.3152 624.4114 742.9249 749.7645 760.1664 790.7609 854.7411 906.0983 940.1794 965.5475 976.4030 1017.8877 1023.6656 1028.9635 1036.4686 1060.4200 1076.1230 1092.8171 1106.9996 1114.8235 1125.1506 1179.7761 1207.8824 1222.1084 1233.2907 1263.2522 1275.9503 1283.5665 1288.5993 1290.6311 1297.1239 1310.5368 1339.6846 1355.4012 1369.6125 1373.6620 1388.9212 1389.9748 1416.0723 1442.7742 1453.4529 1466.2452 1467.4758 1475.5479 1477.4981 1485.1414 1492.6798 1494.4494 1592.7394 1638.3072 1639.8061 2853.6793 2856.2650 2955.4375 2968.3225 2976.4834 2985.9521 2987.1026 2994.6509 3005.2886 3013.4689 3029.0271 3041.2510 3049.5951 3065.6166 3073.2997 3074.8137 3127.2812 3456.2021 3459.2696 3584.4597 3587.2835
redmass: 4.4734 2.9881 1.8550 3.6452 2.1457 3.9572 2.4707 2.0949 1.7972 1.9513 1.6401 2.4636 1.2692 1.2580 2.7381 2.8084 3.1932 3.9371 2.3673 3.1755 2.9164 3.1378 3.2413 1.3373 1.2914 3.7710 1.3338 2.1721 1.1223 1.2144 1.2584 1.3454 2.5044 1.8262 1.8265 2.3354 3.0256 1.6656 2.6095 2.5910 2.1647 2.5750 2.5151 2.1577 1.6306 1.9528 1.9117 1.4222 1.6305 1.4132 1.3626 1.0728 1.1290 1.1527 1.3013 1.2713 1.3477 1.3586 1.3571 1.2394 1.4521 1.4350 2.4353 1.1369 1.0697 1.0713 1.1060 1.0578 1.0934 1.1183 1.0908 1.1031 5.7154 1.0948 1.0942 1.0716 1.0719 1.0653 1.0635 1.0646 1.0457 1.0577 1.0637 1.0834 1.0848 1.0926 1.0963 1.0997 1.1015 1.0980 1.1030 1.0980 1.0448 1.0449 1.0976 1.0979
irintensity: 0.6031 3.5112 3.5434 0.2641 4.0826 1.9072 2.8954 0.9332 1.4374 1.4906 0.8957 2.7715 72.5577 29.8409 11.6084 9.1335 3.4810 3.7743 3.2278 23.4700 29.6509 9.0227 13.5800 189.3243 237.2940 20.0105 9.5654 3.4911 8.1146 0.9317 3.4663 1.1283 1.6363 4.2851 9.0011 6.7809 4.0236 4.0198 4.6058 3.4361 13.4977 3.5690 8.7274 16.4823 41.8433 19.3269 3.6410 33.4036 10.7000 23.5120 17.3239 2.3871 0.8119 14.1801 13.3317 18.1525 0.1678 17.0896 9.3638 21.2574 18.9651 21.8524 110.9839 37.8064 17.8373 0.2744 4.3926 19.4925 15.6237 4.9521 6.4480 3.9888 261.4132 40.8691 41.2903 110.5979 123.7248 28.7295 27.4530 0.6762 13.6218 48.3572 26.7685 51.1557 33.3576 6.5227 4.2820 50.5464 63.9433 24.1952 34.0242 11.2735 1.6947 0.9501 0.1828 0.4344
temp: 298.150 k
press: 1.00000 atm
elementType: 8 7 7 7 6 6 6 6 6 6 6 6 6 1 1 1 1 1 1 1 1 1 1 1 1 1 1 1 1 1 1 1 1 1
symmnumber: 1
zpe: 790745.6 jmol-1
zpe.correction: 0.301179 hartree
zpe.thermalcorrener: 0.318450 hartree
zpe.thermalcorrenthalpy: 0.319394 hartree
zpe.thermalcorrgfe: 0.254148 hartree
zpe.sumelectzpe: -593.937108 hartree
zpe.sumelectthermal: -593.919838 hartree
zpe.sumelectthermalent: -593.918893 hartree
zpe.sumelectthermalfe: -593.984139 hartree
dipole: -2.9198 -3.7030 3.5185
dipole: 5.8837
quadrupole: -65.3126 -89.1890 -84.6785
quadrupole: -6.7631 3.3376 1.3246
quadrupole: 14.4141 -9.4623 -4.9518 -6.7631 3.3376 1.3246
hfenergy: -594.2382872 hartree
pointgroup: C01 [X(C9H21N3O1)]
dipole: 1.1486254 -1.502406 -1.3348551 debye
polarizability: 142.6564487|-1.8322777|128.4224432|-3.5673186|-0.4704676|98.1904442 unknown
InChI: InChI=1S/C9H21N3O/c1-9(13)12(8-4-6-11)7-3-2-5-10/h2-8,10-11H2,1H3
charge 0 multiplicity 1
34 atoms
O  -0.13827 2.787645 0.592737
N  0.574375 0.669076 -0.041518
N  -5.412217 -1.417547 0.139908
N  4.464141 -2.428944 0.536288
C  -0.612717 0.066763 0.610897
C  -1.83762 -0.016755 -0.328751
C  1.526801 -0.24684 -0.702304
C  -3.045608 -0.691091 0.357044
C  2.566577 -0.856218 0.268962
C  -4.289776 -0.753643 -0.552662
C  0.723021 2.052261 0.010926
C  3.515866 -1.849299 -0.433247
C  1.953366 2.661454 -0.666965
H  -0.870201 0.68785 1.486713
H  -0.336196 -0.943844 0.969647
H  -1.566232 -0.576822 -1.24805
H  -2.105448 1.010983 -0.639506
H  0.945642 -1.064295 -1.174267
H  2.04269 0.282912 -1.522763
H  -2.769435 -1.722511 0.667234
H  -3.318971 -0.144618 1.279873
H  3.156406 -0.037754 0.730279
H  2.05566 -1.38477 1.095198
H  -4.602882 0.279337 -0.798632
H  -4.00147 -1.239392 -1.519254
H  2.918206 -2.677968 -0.86171
H  4.006237 -1.329897 -1.295857
H  1.98708 3.725276 -0.389198
H  2.896284 2.178067 -0.354813
H  1.880215 2.592332 -1.768638
H  -5.219815 -2.388501 0.406532
H  -6.320054 -1.320115 -0.324003
H  5.052864 -1.73607 1.00924
H  5.009981 -3.219663 0.182159
