program: Gaussian 09
title: 000128318
version: EM64L-G09RevD.01
frameworkgroup: C1[X(C11H14N4O4)]
method: RPBEPBE
basis: SDD
operation: Freq
keyword: #p
keyword: freq=noraman
keyword: PBEPBE/SDD
title: #p freq=noraman PBEPBE/SDD
converged: NO YES NO NO
title: Mulliken charges:
elementType: O O O O N N N N C C C C C C C C C C C H H H H H H H H H H H H H H
charge: -0.208335 -0.211802 -0.207902 -0.210768 -0.119988 -0.121183 -0.351900 -0.351461 -0.115706 -0.119386 -0.571497 -0.421911 -0.421031 -0.430920 -0.418936 0.151739 0.151072 0.153124 0.156099 0.244717 0.239234 0.250471 0.254221 0.263843 0.227143 0.223438 0.271199 0.230945 0.257626 0.268635 0.223455 0.357566 0.358197
chargesum: 0.00000
title: Mulliken charges with hydrogens summed into heavy atoms:
elementType: O O O O N N N N C C C C C C C C C C C
charge: -0.208335 -0.211802 -0.207902 -0.210768 -0.119988 -0.121183 0.005666 0.006736 0.129011 0.119848 -0.066804 0.069075 0.073606 0.057650 0.073154 0.151739 0.151072 0.153124 0.156099
polarizability: 1.48107726e+02 -5.49106116e+00 1.69052619e+02 2.06325281e+00 -1.37655065e+01 1.38190318e+02
1716.lowfreq: 0.0004 0.0007 0.0008 3.6252 6.2927 10.4167 12.9701 25.2865 40.7678
frequency: 12.0713 25.1699 40.7513 70.4024 82.6051 130.5234 137.6046 148.2910 148.4547 164.8506 209.4104 258.3334 284.3477 323.4414 365.3898 372.8305 374.0368 409.4650 426.2109 441.6447 468.7071 514.6259 538.5315 539.9988 563.2876 580.3299 591.6520 591.8470 595.0447 669.0655 781.6050 786.7418 800.2874 803.6130 844.8956 872.5897 877.6846 897.6816 905.7793 927.0540 951.0704 963.2669 964.4625 1007.6543 1012.4931 1050.9367 1064.3224 1083.2881 1115.6372 1141.9322 1168.0796 1170.6329 1175.5958 1204.3643 1206.6711 1231.5256 1263.6171 1279.2058 1284.2109 1285.6159 1314.7134 1317.2783 1319.4299 1321.5569 1357.8434 1359.3320 1372.8833 1373.0497 1378.4108 1392.1001 1438.7788 1446.2304 1451.3656 1455.6144 1462.6643 1647.4882 1649.6925 1651.3895 1653.3960 2831.9471 2834.5336 2840.7143 2842.7904 2965.8952 2983.8878 3083.6727 3085.9465 3092.4471 3093.6194 3103.8639 3210.5614 3485.4356 3485.9848
redmass: 8.5391 9.1092 11.8336 5.0416 3.8153 3.2246 3.2628 8.3209 7.6832 3.2742 3.6375 2.4159 3.3259 5.2601 5.3228 6.7691 5.6377 4.2947 4.5931 4.2458 3.1924 3.3382 2.9104 3.5297 4.3026 4.4696 3.9299 3.8183 3.9278 3.6130 3.3510 3.2667 1.3181 1.2955 1.6334 4.4396 4.8868 3.0679 3.1148 3.0166 2.6745 1.9196 1.9191 2.3669 2.3344 1.8097 2.0655 1.2581 1.2417 1.8490 1.7039 1.4744 1.4265 3.3868 3.5130 1.3755 1.2625 3.0737 2.9776 1.2899 1.8388 2.2480 3.5039 1.6063 2.3260 2.2173 1.8163 1.8219 1.4316 1.4287 1.0869 1.3811 1.1102 1.0970 1.1448 6.0813 9.9756 6.4970 9.0526 1.0713 1.0715 1.0702 1.0702 1.0836 1.0882 1.0865 1.0858 1.0874 1.0856 1.0571 1.1160 1.0763 1.0763
irintensity: 0.1467 0.2033 0.0472 1.9966 0.4118 1.2898 0.2778 13.2928 4.9884 0.0907 0.7009 7.8800 1.2877 5.3027 27.9711 8.6282 16.8657 0.3255 8.8581 3.8949 11.6604 0.2543 8.1664 0.6302 19.7458 0.8634 3.3980 8.7180 2.8227 1.6672 5.2589 3.4344 184.9497 67.4912 9.4677 0.0491 0.3117 0.6154 12.5957 77.5181 3.5734 1.4476 4.2225 3.6524 3.8913 6.6210 10.6839 2.8543 8.8075 10.7216 38.7220 12.8865 60.1877 6.1447 2.3685 45.3783 0.3748 72.9928 482.3505 26.5474 9.2553 41.8532 136.7375 24.7405 8.1191 5.6286 2.5108 11.8033 39.5488 13.4311 1.3332 17.7963 8.3867 0.1350 21.6780 32.1890 140.1250 616.9649 377.5712 47.0054 58.8785 174.6451 36.0680 4.6019 130.8106 4.7679 9.7074 3.7612 5.0641 5.8439 10.1361 35.1479 44.8325
temp: 298.150 k
press: 1.00000 atm
elementType: 8 8 8 8 7 7 7 7 6 6 6 6 6 6 6 6 6 6 6 1 1 1 1 1 1 1 1 1 1 1 1 1 1
symmnumber: 1
zpe: 666953.7 jmol-1
zpe.correction: 0.254029 hartree
zpe.thermalcorrener: 0.271165 hartree
zpe.thermalcorrenthalpy: 0.272109 hartree
zpe.thermalcorrgfe: 0.206533 hartree
zpe.sumelectzpe: -946.031016 hartree
zpe.sumelectthermal: -946.013881 hartree
zpe.sumelectthermalent: -946.012937 hartree
zpe.sumelectthermalfe: -946.078513 hartree
dipole: -0.0902 -4.6550 -4.9092
dipole: 6.7659
quadrupole: -123.3060 -123.6885 -114.5449
quadrupole: 2.4485 -1.0977 14.4522
quadrupole: -2.7929 -3.1754 5.9683 2.4485 -1.0977 14.4522
hfenergy: -946.2850456 hartree
pointgroup: C01 [X(C11H14N4O4)]
dipole: 0.0759481 1.97761 -1.7801972 debye
polarizability: 147.7126786|-4.4351506|166.9981831|-2.0587664|16.1902113|140.6398014 unknown
InChI: InChI=1S/C11H14N4O4/c16-8-2-14(3-9(17)12-8)6-1-7(6)15-4-10(18)13-11(19)5-15/h6-7,12-13H,1-5H2
charge 0 multiplicity 1
33 atoms
O  -2.502305 -2.803654 -0.488465
O  -4.137568 0.719047 2.054985
O  2.734044 -2.741988 -0.866131
O  3.824519 0.473101 2.302582
N  -1.558529 0.720678 -0.514736
N  1.55119 0.689802 -0.529646
N  -3.227977 -1.019479 0.81019
N  3.183308 -1.122531 0.739597
C  -0.780589 1.664067 -1.288345
C  0.779313 1.663134 -1.273272
C  -0.004718 2.73532 -0.51685
C  -1.850242 -0.548321 -1.203899
C  -2.757272 1.311906 0.111192
C  2.024187 -0.441753 -1.346809
C  2.630928 1.255788 0.302741
C  -2.527456 -1.564082 -0.285472
C  -3.424704 0.347678 1.08864
C  2.652851 -1.544016 -0.496439
C  3.250632 0.201752 1.217887
H  -1.212376 1.980288 -2.258046
H  1.219973 1.9951 -2.233286
H  0.009567 3.763346 -0.887864
H  -0.031634 2.627991 0.572402
H  -0.916328 -1.011003 -1.557032
H  -2.512005 -0.421106 -2.101548
H  -3.536424 1.622116 -0.633973
H  -2.477951 2.214066 0.677779
H  2.786633 -0.136584 -2.11226
H  1.185746 -0.894681 -1.898219
H  2.233903 2.055866 0.94591
H  3.464335 1.703085 -0.300648
H  -3.677466 -1.68971 1.447108
H  3.601317 -1.850123 1.333529
