program: Gaussian 09
title: 000128268
version: EM64L-G09RevD.01
frameworkgroup: C1[X(C16H15N3O)]
method: RPBEPBE
basis: SDD
operation: Freq
keyword: #p
keyword: freq=noraman
keyword: PBEPBE/SDD
title: #p freq=noraman PBEPBE/SDD
converged: YES YES NO YES
title: Mulliken charges:
elementType: O N N N C C C C C C C C C C C C C C C C H H H H H H H H H H H H H H H
charge: -0.268324 -0.206480 -0.448672 -0.151140 0.217711 0.457366 0.456814 -0.138944 -0.478247 -0.475437 -0.304031 -0.359189 -0.366793 0.320717 -0.328934 -0.372190 -0.222422 -0.199953 -0.253844 -0.538112 0.303794 0.254580 0.250681 0.213047 0.299804 0.221391 0.275946 0.237473 0.244732 0.224914 0.227906 0.229836 0.216701 0.216700 0.242598
chargesum: 0.00000
title: Mulliken charges with hydrogens summed into heavy atoms:
elementType: O N N N C C C C C C C C C C C C C C C C
charge: -0.268324 -0.206480 -0.144877 -0.151140 0.217711 0.457366 0.456814 0.115636 -0.227566 -0.262390 -0.004227 -0.137798 -0.090847 0.320717 -0.091461 -0.127458 0.002493 0.027953 -0.024008 0.137888
polarizability: 3.61943610e+02 1.13758848e+01 2.28283056e+02 1.91551641e-02 8.09671270e-03 8.06436388e+01
1716.lowfreq: -2.7055 -0.0009 0.0002 0.0008 3.4858 8.5419 25.6301 37.2976 49.1872
frequency: 25.2600 37.2521 49.1858 50.4441 86.7009 102.9093 142.9805 155.4478 195.8610 231.9621 244.1883 284.4888 301.5923 319.3147 366.1679 381.9531 405.3087 416.0966 443.9501 473.3666 497.3994 506.1451 529.8507 554.5422 599.0738 614.0536 627.5210 667.7888 675.5901 690.4407 718.5361 733.0059 733.5035 762.3109 783.5296 794.9642 827.8165 840.4550 843.8192 845.3425 909.7677 910.4782 923.9447 970.2160 975.9084 983.2210 986.7976 990.2408 992.9889 1002.3089 1023.1210 1035.0496 1072.3381 1084.1720 1112.1105 1120.2019 1157.1290 1171.1159 1181.9326 1186.3201 1218.6047 1220.0816 1228.4266 1264.5818 1308.1233 1324.9815 1331.1485 1377.9437 1386.9833 1401.4894 1429.8078 1437.0600 1451.0072 1455.5800 1465.3757 1474.3545 1495.7960 1504.6441 1543.8779 1570.4682 1595.3843 1597.3393 1615.2851 1636.0965 2950.7329 3034.1662 3107.5014 3121.2126 3130.5047 3139.9516 3155.3521 3157.6172 3161.3630 3168.5376 3188.0046 3192.0431 3221.6986 3252.0773 3566.1936
redmass: 3.7129 3.5257 5.7140 4.5416 4.0761 4.4740 5.1581 4.1897 4.1601 2.0306 1.7678 4.2322 6.1406 4.6977 4.0266 6.0778 2.8721 3.0691 4.8848 4.5052 1.9445 2.1100 1.8786 5.2196 3.9934 6.4339 7.0952 3.8109 6.2762 1.9542 3.3258 5.4757 1.4443 1.6917 6.4440 1.4097 1.3831 1.3368 5.6242 1.4619 1.4162 1.3960 7.3459 1.3595 1.3136 5.7971 6.0123 6.4523 1.3123 2.9238 2.4765 2.2105 1.3850 1.6435 1.2610 1.3540 1.3319 1.0569 1.2633 1.1998 2.4784 2.3499 2.1455 2.7554 1.4498 1.3806 3.1188 5.9722 7.6256 4.3540 3.0634 1.2713 2.4660 2.7400 1.0505 1.0852 2.7324 2.3287 2.8637 8.0775 4.7212 5.3237 6.1566 6.2945 1.0335 1.1035 1.0894 1.0985 1.0849 1.0893 1.0939 1.0901 1.0933 1.0995 1.0954 1.0948 1.0932 1.1058 1.0758
irintensity: 0.1898 3.6086 0.1237 1.3716 0.0177 6.8234 1.1709 2.8136 2.6954 1.0186 0.2503 2.8687 4.7318 0.3887 6.5418 1.7490 0.0405 0.0268 1.0601 1.1500 78.4999 14.2034 1.1922 18.5884 3.0745 0.1324 0.3861 0.0003 14.5548 16.8462 3.2713 28.3396 117.6309 85.4297 3.3029 43.6839 4.9002 0.3931 2.9495 59.8893 4.4835 5.7304 61.6398 0.0122 1.0579 6.1008 34.1251 28.7868 1.3814 29.5688 11.7890 32.7180 14.7776 6.0961 0.2186 18.4435 1.0442 0.1706 64.2092 6.1932 13.2420 256.0094 25.0000 0.1247 0.5264 9.0625 27.1183 100.5101 18.6563 10.1153 2.7581 11.2795 2.1888 7.4575 12.6876 111.4128 216.4112 205.2369 89.7139 956.7997 146.8752 3.3592 68.8778 19.7138 99.7746 56.8001 25.2997 26.0656 3.5697 10.1315 32.4809 5.4879 18.2061 23.2931 8.6320 2.6849 0.9912 0.9775 31.8070
temp: 298.150 k
press: 1.00000 atm
elementType: 8 7 7 7 6 6 6 6 6 6 6 6 6 6 6 6 6 6 6 6 1 1 1 1 1 1 1 1 1 1 1 1 1 1 1
symmnumber: 1
zpe: 725121.7 jmol-1
zpe.correction: 0.276184 hartree
zpe.thermalcorrener: 0.293163 hartree
zpe.thermalcorrenthalpy: 0.294107 hartree
zpe.thermalcorrgfe: 0.229728 hartree
zpe.sumelectzpe: -856.744931 hartree
zpe.sumelectthermal: -856.727952 hartree
zpe.sumelectthermalent: -856.727008 hartree
zpe.sumelectthermalfe: -856.791388 hartree
dipole: 0.2554 3.1849 -0.0010
dipole: 3.1951
quadrupole: -82.9833 -99.5756 -126.3450
quadrupole: 4.1248 0.0028 0.0018
quadrupole: 19.9847 3.3924 -23.3770 4.1248 0.0028 0.0018
hfenergy: -857.0211152 hartree
pointgroup: C01 [X(C16H15N3O1)]
dipole: 0.1192181 -1.2513975 0.0003802 debye
polarizability: 362.2540028|-9.3716119|227.9726632|-0.0192741|0.0078093|80.6436388 unknown
InChI: InChI=1S/C16H15N3O/c1-20-15-9-7-13(8-10-15)17-16-11-12-19(18-16)14-5-3-2-4-6-14/h2-12,17H,1H3
charge 0 multiplicity 1
35 atoms
O  5.262063 1.902983 -0.000521
N  -2.276491 -0.936006 0.000362
N  1.115279 -1.960702 -0.000387
N  -0.907359 -0.598907 -0.000149
C  -0.267467 -1.808804 0.000037
C  -3.25396 0.102502 0.000435
C  2.13516 -0.977925 -0.000426
C  -2.463662 -2.310335 0.00088
C  -1.204143 -2.906035 0.000622
C  3.484893 -1.418572 -0.00042
C  1.871841 0.422185 -0.000502
C  -4.638167 -0.209557 -0.000098
C  -2.834218 1.45672 0.001052
C  4.281817 0.890412 -0.000504
C  4.554814 -0.499588 -0.000465
C  2.938698 1.337047 -0.000525
C  -5.5901 0.830641 0.000076
C  -3.798105 2.48549 0.00118
C  -5.179846 2.183816 0.000717
C  6.660056 1.477227 -0.000606
H  1.436846 -2.92847 -0.000503
H  -3.448275 -2.768529 0.001483
H  -0.986599 -3.97203 0.000928
H  3.706844 -2.494097 -0.000363
H  0.837621 0.769676 -0.000552
H  -4.982041 -1.248508 -0.00071
H  -1.764592 1.67586 0.001423
H  5.581345 -0.877813 -0.000456
H  2.747941 2.414829 -0.000578
H  -6.656666 0.580016 -0.000337
H  -3.465128 3.529298 0.001661
H  -5.923554 2.987397 0.00083
H  6.903759 0.884328 -0.904892
H  6.903888 0.884386 0.903683
H  7.246408 2.407961 -0.000677
