program: Gaussian 09
title: 000128300
version: EM64L-G09RevD.01
frameworkgroup: C1[X(C18H26N2O2)]
method: RPBEPBE
basis: SDD
operation: Freq
keyword: #p
keyword: freq=noraman
keyword: PBEPBE/SDD
title: #p freq=noraman PBEPBE/SDD
converged: YES YES NO NO
title: Mulliken charges:
elementType: O O N N C C C C C C C C C C C C C C C C C C H H H H H H H H H H H H H H H H H H H H H H H H H H
charge: -0.231711 -0.213719 -0.355793 0.005893 0.176927 -0.459140 -0.560060 -0.398238 0.436307 0.101784 -0.495489 -0.389985 -0.386179 0.149029 -0.374105 -0.344522 -0.336107 -0.353698 -0.356929 -0.358929 -0.357543 -0.696145 0.217658 0.242043 0.257441 0.224421 0.220200 0.200468 0.255068 0.265337 0.206769 0.193164 0.196686 0.190661 0.350438 0.189581 0.193215 0.233909 0.273159 0.187201 0.189276 0.196094 0.194624 0.241510 0.243855 0.210300 0.215978 0.209301
chargesum: 0.00000
title: Mulliken charges with hydrogens summed into heavy atoms:
elementType: O O N N C C C C C C C C C C C C C C C C C C
charge: -0.231711 -0.213719 -0.005355 0.005893 0.176927 0.000561 -0.078198 0.022430 0.436307 0.101784 0.024916 0.009948 0.001167 0.149029 0.008690 -0.110613 -0.062948 0.022779 0.033789 -0.117419 -0.113688 -0.060567
polarizability: 2.38875352e+02 1.14014894e+01 2.02944179e+02 1.03853419e+01 -6.39255053e+00 1.85944642e+02
1716.lowfreq: -14.8889 -4.7856 -0.0006 -0.0005 -0.0002 5.8737 14.1434 22.1429 28.8964
frequency: 4.3364 21.8688 28.8308 30.9084 49.1328 57.4869 73.1843 77.1872 106.1273 124.3984 134.4944 142.1662 142.8630 147.5681 166.6784 195.2244 226.7522 232.9044 260.9743 298.1704 304.1011 333.0411 354.7249 369.0950 376.0541 419.4493 444.4502 466.9122 473.8387 529.5894 544.1380 574.4992 584.8119 659.2268 664.5684 692.7357 712.7456 718.9337 724.5299 737.4794 755.3638 770.2256 788.2759 815.0013 828.4816 842.4530 872.9239 889.0859 892.7100 900.0971 928.1699 963.9144 966.1019 976.3686 986.1183 991.5811 1008.5077 1015.3347 1032.2559 1051.2855 1061.4813 1071.0561 1074.1031 1078.7432 1081.9380 1093.8468 1102.4937 1120.9218 1152.2091 1172.8166 1188.9775 1196.9433 1208.7940 1225.8187 1232.3636 1233.5629 1260.3330 1266.5567 1280.5020 1282.4302 1291.5083 1293.8873 1295.6189 1297.5670 1302.8897 1321.1908 1325.5623 1333.1020 1335.7512 1349.8139 1351.8431 1355.3470 1357.2278 1375.9055 1389.0730 1402.7085 1445.3150 1451.0703 1458.3385 1460.4286 1463.2346 1465.9991 1468.8446 1475.8586 1477.3686 1482.8843 1488.2801 1491.5146 1546.8410 1577.0482 1617.2797 1646.3730 2949.7721 2949.8921 2954.0304 2959.1394 2966.7915 2968.5868 2971.5597 2983.3880 2985.2567 2991.7677 3001.1633 3003.3273 3014.8724 3017.1047 3029.4199 3039.6009 3057.4370 3067.1246 3067.9950 3070.6170 3080.0368 3127.8159 3133.8967 3156.1018 3160.7749 3475.4250
redmass: 2.0279 2.8481 5.0422 4.2203 6.0216 3.4009 3.8304 1.7632 2.6603 3.1446 2.1045 4.6316 2.7091 4.6858 4.3487 3.7262 5.4016 1.1161 2.7586 2.9327 3.4321 4.2820 5.3923 2.6262 3.4226 3.5994 3.3046 4.1530 3.2906 4.1551 3.8053 3.4606 4.3760 5.8145 5.8558 3.4415 2.3302 1.1321 1.2576 1.1955 3.4576 1.6256 1.6442 1.4012 1.4560 1.4439 2.2297 1.8874 1.2660 2.3038 1.4169 4.2204 1.6369 1.6544 1.5696 3.4253 1.9791 1.8317 2.6162 3.3025 2.6198 2.4043 2.1212 2.4379 2.1805 2.5536 1.6395 2.7105 1.8762 2.0524 1.8019 1.9605 1.4837 1.5608 1.3550 1.4431 1.3611 1.4124 1.5005 1.0289 1.5745 1.5222 2.4674 1.2026 1.6783 1.8170 1.4843 1.3846 1.4392 1.4411 1.5191 1.6157 1.4984 1.7910 1.2168 1.9591 1.0818 1.0853 1.0744 1.0736 1.0725 1.8374 1.0828 1.0784 1.0446 1.0864 1.0899 1.0972 6.9624 5.2895 7.5311 6.8661 1.0588 1.0588 1.0594 1.0593 1.0588 1.0592 1.0366 1.0951 1.0640 1.0975 1.0654 1.0999 1.0794 1.0837 1.1031 1.1039 1.1029 1.1002 1.1007 1.0993 1.0971 1.0879 1.0891 1.0943 1.0975 1.0758
irintensity: 0.1629 0.2110 0.2002 0.0211 0.6585 0.4455 0.2708 0.0878 0.2406 0.1147 0.0195 8.0462 0.6304 3.8574 0.1752 0.2047 2.3893 0.0015 1.0542 2.4107 0.1353 0.9514 11.0363 1.1908 7.0269 6.5018 2.6824 0.5297 3.5946 0.9630 6.0046 48.6423 4.3280 1.3248 0.9091 10.8405 15.0912 11.6033 1.0496 3.1904 1.9403 2.8929 3.5974 96.6398 47.8417 1.4643 2.6923 4.2250 1.2726 5.4360 1.5512 1.9415 1.0029 2.2440 0.1104 0.6659 2.6494 3.0924 0.3286 0.4007 12.3966 3.2042 3.2917 0.4339 0.8797 7.7356 7.3742 18.5354 1.2122 0.8376 72.5910 135.1009 19.1192 9.0532 15.6883 3.5297 16.0696 30.1142 53.3331 1.0581 6.9089 27.9872 40.5285 0.8312 16.9255 23.0842 18.2134 1.1996 8.5708 4.5907 0.7305 0.6458 0.8585 4.6905 11.2043 19.0299 13.0250 8.6392 0.0913 0.7212 0.2728 16.8754 2.6548 2.9528 11.8249 4.8344 25.0470 13.1126 13.0830 81.4809 165.6749 363.3422 0.3274 0.3391 1.1040 23.8364 29.8780 139.0016 37.8569 0.2604 32.2502 2.4471 7.5617 1.4551 10.3045 11.1776 3.4739 121.9561 50.3078 19.1646 96.2544 54.5550 12.9540 13.5423 13.8627 24.4501 1.2990 38.6979
temp: 298.150 k
press: 1.00000 atm
elementType: 8 8 7 7 6 6 6 6 6 6 6 6 6 6 6 6 6 6 6 6 6 6 1 1 1 1 1 1 1 1 1 1 1 1 1 1 1 1 1 1 1 1 1 1 1 1 1 1
symmnumber: 1
zpe: 1073318.9 jmol-1
zpe.correction: 0.408806 hartree
zpe.thermalcorrener: 0.431718 hartree
zpe.thermalcorrenthalpy: 0.432662 hartree
zpe.thermalcorrgfe: 0.351566 hartree
zpe.sumelectzpe: -959.814662 hartree
zpe.sumelectthermal: -959.791750 hartree
zpe.sumelectthermalent: -959.790805 hartree
zpe.sumelectthermalfe: -959.871901 hartree
dipole: 2.9429 -0.2335 -2.7095
dipole: 4.0071
quadrupole: -153.8684 -153.8509 -127.3451
quadrupole: 0.8022 3.5006 -0.1280
quadrupole: -8.8469 -8.8294 17.6763 0.8022 3.5006 -0.1280
hfenergy: -960.2234672 hartree
pointgroup: C01 [X(C18H26N2O2)]
dipole: 1.1690551 -0.2171867 -1.0351351 debye
polarizability: 239.2799351|11.1914198|201.0265772|10.0130301|-7.8309496|187.4576609 unknown
InChI: InChI=1S/C18H26N2O2/c1-2-3-4-5-6-7-11-18(15-9-13-19-14-10-15)12-8-16(21)20-17(18)22/h9-10,13-14,20H,2-8,11-12H2,1H3
charge 0 multiplicity 1
48 atoms
O  -0.876468 0.941734 2.10257
O  -3.403562 3.893974 -0.392347
N  -2.11499 2.357085 0.767778
N  -4.498988 -2.874243 0.188752
C  -1.317689 0.17967 -0.219007
C  0.017611 -0.638335 -0.122789
C  -1.391461 1.001684 -1.536075
C  1.323407 0.170385 -0.291229
C  -2.477929 -0.843345 -0.080611
C  -1.394195 1.16192 0.974128
C  -2.650261 1.888918 -1.610313
C  2.571152 -0.688849 0.01816
C  3.898334 0.073839 -0.191184
C  -2.773711 2.805837 -0.40326
C  5.147879 -0.773372 0.138791
C  -3.111255 -1.417779 -1.212375
C  -2.88313 -1.325694 1.191143
C  6.476163 -0.013995 -0.07778
C  7.726413 -0.858804 0.257857
C  -4.098435 -2.413125 -1.032379
C  -3.881179 -2.321128 1.275373
C  9.048874 -0.09288 0.037622
H  -0.027274 -1.441101 -0.885707
H  0.031454 -1.133582 0.865937
H  -0.495711 1.645357 -1.599065
H  -1.346013 0.327135 -2.409214
H  1.313827 1.044474 0.390315
H  1.410167 0.562953 -1.324283
H  -2.651143 2.527947 -2.509509
H  -3.568664 1.271849 -1.656565
H  2.513845 -1.046588 1.066584
H  2.564469 -1.595677 -0.62276
H  3.898769 0.987265 0.439633
H  3.960213 0.422563 -1.243612
H  -2.183927 2.978548 1.584452
H  5.144746 -1.691041 -0.486379
H  5.089666 -1.116057 1.193073
H  -2.850406 -1.116508 -2.231576
H  -2.426316 -0.940298 2.108221
H  6.537856 0.325837 -1.133094
H  6.479526 0.905461 0.544608
H  7.664625 -1.196958 1.312492
H  7.722319 -1.777972 -0.363309
H  -4.595269 -2.864936 -1.898759
H  -4.206231 -2.699941 2.250871
H  9.092756 0.812712 0.671889
H  9.926394 -0.719322 0.282349
H  9.148241 0.231482 -1.015616
