program: Gaussian 09
title: 000128252
version: EM64L-G09RevD.01
frameworkgroup: C1[X(C12H13N5O3)]
method: RPBEPBE
basis: SDD
operation: Freq
keyword: #p
keyword: freq=noraman
keyword: PBEPBE/SDD
title: #p freq=noraman PBEPBE/SDD
converged: YES YES NO NO
title: Mulliken charges:
elementType: O O O N N N N N C C C C C C C C C C C C H H H H H H H H H H H H H
charge: -0.271699 -0.424272 -0.486233 -0.148272 -0.054280 -0.071846 -0.627636 -0.052050 -0.054538 -0.162324 -0.181863 -0.008179 -0.702873 0.136630 -0.319569 -0.025826 0.264500 0.156060 -0.370880 -0.254908 0.285309 0.265040 0.237663 0.232653 0.250343 0.211192 0.218049 0.288293 0.372896 0.364615 0.245578 0.351328 0.337102
chargesum: 0.00000
title: Mulliken charges with hydrogens summed into heavy atoms:
elementType: O O O N N N N N C C C C C C C C C C C C
charge: -0.271699 -0.051377 -0.121618 -0.148272 -0.054280 -0.071846 0.060795 -0.052050 0.230771 0.102716 0.055800 0.224474 -0.023289 0.136630 -0.031277 -0.025826 0.264500 0.156060 -0.125302 -0.254908
polarizability: 2.37821222e+02 8.72789342e+00 1.94115325e+02 8.77479623e+00 1.21819335e+01 9.79146421e+01
1716.lowfreq: -7.0667 -0.0012 -0.0010 -0.0006 2.1278 7.6757 24.7406 39.6575 53.5432
frequency: 24.1205 39.6226 53.4904 63.0983 91.4724 104.9929 135.7926 167.9408 197.8231 201.5277 220.1649 222.6740 248.8930 269.8893 279.2577 301.4497 323.9509 328.4168 402.3069 442.0015 477.4644 495.9026 499.4872 506.5187 510.0861 532.6368 546.0554 555.3913 567.4688 575.9677 637.6131 647.2340 661.8353 669.9803 685.0603 727.6631 797.4674 811.3630 816.9076 836.4786 867.0080 903.2619 930.1015 942.9529 962.1822 964.5748 995.7914 1007.8148 1054.7967 1067.1557 1103.6454 1106.7153 1123.1184 1151.4581 1160.1873 1185.5221 1219.7776 1243.9558 1248.6767 1262.8332 1278.2427 1290.8767 1314.1150 1323.4522 1337.9808 1342.0752 1362.8009 1370.7260 1378.1642 1393.9115 1412.9160 1422.9898 1444.7404 1461.3969 1475.1042 1517.5438 1552.7005 1581.4071 1632.5822 2170.0865 2987.4756 2996.2283 3021.3827 3025.7755 3058.0100 3082.4471 3100.6923 3167.7609 3247.7372 3489.9620 3530.5898 3610.9800 3681.7482
redmass: 4.9929 5.0322 5.7767 4.7939 5.9913 10.2785 6.4265 7.9539 4.7382 2.9991 1.4110 1.1138 4.7615 4.5037 3.7613 4.4093 3.8399 5.6522 4.0712 7.9783 3.6693 5.6912 1.8436 1.2416 1.9563 5.8356 1.8094 2.3300 3.7210 5.2641 5.3278 3.4780 5.7240 9.5254 6.0856 5.5510 8.6533 3.5688 1.7062 3.4630 3.7098 2.0408 1.4356 6.0676 2.4700 4.8365 2.4929 3.4356 3.2109 2.4911 2.0294 3.0837 2.1690 2.7862 1.5605 1.4250 1.3867 1.3453 3.2054 1.3932 1.4666 1.3751 2.2965 2.7027 2.2457 3.2999 1.5451 3.0661 1.2589 1.2241 1.7252 3.2697 3.8709 1.0537 1.0458 6.4161 6.9448 2.9598 1.7516 12.5892 1.0369 1.0861 1.0869 1.0860 1.0870 1.0993 1.0993 1.0923 1.0987 1.0644 1.0451 1.0672 1.1053
irintensity: 0.3660 1.4933 2.4444 1.5918 4.6310 7.5407 1.6720 0.6203 9.7471 19.1815 89.8233 25.1150 3.0753 15.5781 6.6143 4.2599 7.7582 2.7424 2.6956 3.8475 2.0304 0.9568 40.9956 193.2779 60.5612 1.8977 70.0184 61.3159 26.7739 12.6467 12.6267 25.1844 9.4309 8.3164 31.6127 20.3685 1.4531 21.9817 24.2485 7.0003 26.4580 14.9835 10.3022 131.7913 0.7778 68.4950 33.0924 46.3448 120.9794 61.2555 37.3735 11.9037 3.4398 16.6928 28.6304 104.7107 24.0332 3.3105 1.8844 25.8323 51.2506 16.4169 40.1799 41.0038 0.5839 29.1871 9.8023 29.7524 52.5471 24.6066 39.7907 73.9807 38.2594 9.7135 12.0150 103.2379 33.9268 124.6417 467.1484 116.5854 14.5807 40.5805 28.9639 10.6442 18.7573 44.8921 18.8264 17.5854 4.0012 45.2278 98.4472 20.8780 52.5814
temp: 298.150 k
press: 1.00000 atm
elementType: 8 8 8 7 7 7 7 7 6 6 6 6 6 6 6 6 6 6 6 6 1 1 1 1 1 1 1 1 1 1 1 1 1
symmnumber: 1
zpe: 653421.8 jmol-1
zpe.correction: 0.248875 hartree
zpe.thermalcorrener: 0.267055 hartree
zpe.thermalcorrenthalpy: 0.267999 hartree
zpe.thermalcorrgfe: 0.201916 hartree
zpe.sumelectzpe: -963.033415 hartree
zpe.sumelectthermal: -963.015235 hartree
zpe.sumelectthermalent: -963.014291 hartree
zpe.sumelectthermalfe: -963.080374 hartree
dipole: -6.7404 -0.0049 -0.5977
dipole: 6.7668
quadrupole: -80.8414 -129.0641 -125.7908
quadrupole: -8.0579 0.6984 -0.4545
quadrupole: 31.0574 -17.1654 -13.8920 -8.0579 0.6984 -0.4545
hfenergy: -963.2822899 hartree
pointgroup: C01 [X(C12H13N5O3)]
dipole: 2.6518963 0.1316628 0.194442 debye
polarizability: 238.5698152|-5.7766797|187.4693406|9.0690447|-26.0924484|103.8120334 unknown
InChI: InChI=1S/C12H13N5O3/c1-5-8(18)9(19)12(20-5)17-3-6(2-13)7-10(14)15-4-16-11(7)17/h3-5,8-9,12,18-19H,14H2,1H3
charge 0 multiplicity 1
33 atoms
O  2.179757 0.818711 1.028753
O  2.217228 -1.385089 -1.942606
O  4.208685 -1.446481 -0.19704
N  0.142502 0.126216 0.025295
N  -0.817733 -2.012243 0.781411
N  -3.268681 -2.07364 0.714681
N  -4.592598 -0.273127 -0.001917
N  -3.459385 3.145783 -1.164804
C  1.542163 -0.221997 0.196016
C  2.390592 -0.220876 -1.112088
C  3.825446 -0.065066 -0.543562
C  3.646223 0.837469 0.708437
C  4.070638 2.294669 0.50727
C  -0.92733 -0.74013 0.308424
C  -0.365195 1.341512 -0.425598
C  -2.136288 -0.049859 0.013197
C  -1.767679 1.277349 -0.450799
C  -3.343092 -0.786077 0.23657
C  -2.033158 -2.605708 0.959682
C  -2.660811 2.311562 -0.842777
H  1.568766 -1.217259 0.679228
H  2.118408 0.651651 -1.730025
H  4.531603 0.365528 -1.277813
H  4.177322 0.386909 1.570071
H  3.757372 2.899055 1.375167
H  5.169603 2.373749 0.411325
H  3.606853 2.728658 -0.396791
H  0.287913 2.178299 -0.657882
H  2.754683 -2.115186 -1.529645
H  5.168663 -1.50119 0.027018
H  -2.022599 -3.629842 1.343454
H  -4.729132 0.672153 -0.354926
H  -5.396439 -0.869404 0.187172
