program: Gaussian 09
title: 000128272
version: EM64L-G09RevD.01
frameworkgroup: C1[X(C13H15NO8)]
method: RPBEPBE
basis: SDD
operation: Freq
keyword: #p
keyword: freq=noraman
keyword: PBEPBE/SDD
title: #p freq=noraman PBEPBE/SDD
converged: YES YES NO NO
title: Mulliken charges:
elementType: O O O O O O O O N C C C C C C C C C C C C C H H H H H H H H H H H H H H H
charge: -0.291561 -0.272467 -0.263817 -0.273938 -0.410744 -0.416130 -0.226493 -0.212598 -0.453537 -0.494463 0.100730 0.134767 0.231032 0.218874 -0.772972 -0.756725 0.157519 0.126308 -0.359222 -0.363909 0.208162 0.213922 0.269258 0.255907 0.301949 0.258017 0.192510 0.304053 0.189960 0.268017 0.277914 0.265170 0.286871 0.269406 0.270282 0.385057 0.382888
chargesum: 0.00000
title: Mulliken charges with hydrogens summed into heavy atoms:
elementType: O O O O O O O O N C C C C C C C C C C C C C
charge: -0.291561 -0.272467 -0.263817 -0.273938 -0.025687 -0.033241 -0.226493 -0.212598 -0.151588 0.030703 0.100730 0.134767 0.231032 0.218874 -0.018392 -0.020834 0.157519 0.126308 0.192819 0.175779 0.208162 0.213922
polarizability: 2.64370858e+02 3.11479010e+00 1.90895494e+02 -3.61388114e+00 1.79686264e+01 1.17322537e+02
1716.lowfreq: -5.9841 -1.2099 -0.0009 -0.0007 -0.0006 4.3644 13.7880 22.0116 28.2105
frequency: 13.6261 21.8687 28.1959 34.4089 44.4335 48.2936 50.2319 70.9431 76.5210 90.1470 103.9154 119.6641 160.7275 193.2648 215.7356 232.6589 249.0475 250.2824 264.0129 302.5338 307.3944 313.6754 324.7750 333.1264 377.0411 391.6419 453.4863 473.6485 481.3325 486.5650 552.7719 563.5635 581.5788 587.5623 599.3339 618.7909 620.9130 623.2582 629.6813 646.2801 669.2063 700.9875 720.5065 731.6253 751.9888 840.2692 847.2715 934.9309 947.5655 974.2859 979.2828 1003.2026 1004.2378 1013.5115 1022.7099 1031.1077 1035.8078 1045.0476 1066.6517 1074.4052 1101.7278 1150.1450 1215.2405 1216.2884 1219.1476 1235.0468 1241.8908 1263.0663 1265.2113 1306.6374 1318.7629 1350.8040 1360.7212 1365.8958 1407.8619 1412.7238 1415.0592 1432.9105 1441.4884 1450.3891 1466.0881 1475.9813 1477.4542 1486.7432 1593.6685 1605.2281 1642.7843 1664.5378 1679.8017 1692.6865 2981.9085 2987.9839 2991.4940 3002.5681 3021.4147 3022.6499 3077.6243 3087.4243 3088.0155 3098.0423 3106.1010 3109.6074 3521.2210 3522.3766 3555.8424
redmass: 7.5116 5.5654 5.9702 6.5000 8.1319 8.9058 8.3224 5.9766 3.8769 2.6226 4.1103 1.4094 1.8036 1.6713 3.7301 3.4212 5.8825 5.7763 5.0458 4.2944 6.1858 5.6857 4.2162 2.7163 5.7145 6.6799 3.9767 1.8896 3.9286 2.2954 4.1637 4.3431 1.2242 4.0595 5.2058 1.8287 2.3353 3.7514 1.8110 4.8007 4.8600 6.2362 8.2179 6.5791 5.4598 4.6071 4.4953 4.9212 6.7630 1.6631 1.8165 3.8496 2.3328 2.4869 2.8395 2.2514 1.5188 1.5210 2.8206 3.9517 3.8318 4.5783 1.1160 1.1107 2.0784 1.1573 3.3224 1.8887 1.8117 2.2632 5.2320 1.8134 1.7093 2.2132 1.2012 1.1656 1.1096 1.0946 1.0465 1.0759 1.1605 1.1159 1.4834 1.2814 8.7441 9.2028 4.3304 8.2213 8.7872 9.1241 1.0637 1.0390 1.0389 1.0610 1.0970 1.0606 1.0978 1.0982 1.0991 1.0970 1.0978 1.1005 1.0643 1.0642 1.0773
irintensity: 0.0580 0.3101 0.6601 1.8288 5.6145 0.8679 0.8778 2.0389 1.1561 0.0811 1.1872 2.0863 1.0815 1.8761 1.9607 9.4371 2.8923 0.3262 0.5956 21.3518 0.7195 6.9688 11.9668 2.4243 7.2854 11.6230 25.1451 24.4523 109.4337 33.3840 3.6322 8.2944 61.6017 9.6694 7.5905 82.3655 76.4184 1.5069 83.9766 32.9707 5.5416 30.4283 2.8403 6.2835 71.1620 11.1364 3.8332 50.3166 11.0386 25.8036 7.6829 649.7367 45.4823 352.3968 324.4187 166.1167 12.4429 5.4979 25.5736 9.6781 146.8747 12.5307 1.6102 30.5351 408.2690 7.4352 17.5562 1.0634 7.8101 108.9155 52.7054 170.8104 35.4158 17.4061 102.7005 28.8058 60.7633 70.2580 18.5102 53.3513 52.0115 11.1138 244.4646 267.2247 317.5079 222.6963 9.0719 245.9082 227.1191 193.3163 9.2220 29.1521 31.5215 60.6972 10.0702 26.4241 17.3353 17.8684 2.3949 6.2072 4.4346 1.6007 34.5605 29.8432 45.7849
temp: 298.150 k
press: 1.00000 atm
elementType: 8 8 8 8 8 8 8 8 7 6 6 6 6 6 6 6 6 6 6 6 6 6 1 1 1 1 1 1 1 1 1 1 1 1 1 1 1
symmnumber: 1
zpe: 718129.0 jmol-1
zpe.correction: 0.273521 hartree
zpe.thermalcorrener: 0.296498 hartree
zpe.thermalcorrenthalpy: 0.297442 hartree
zpe.thermalcorrgfe: 0.216572 hartree
zpe.sumelectzpe: -1159.292035 hartree
zpe.sumelectthermal: -1159.269058 hartree
zpe.sumelectthermalent: -1159.268114 hartree
zpe.sumelectthermalfe: -1159.348984 hartree
dipole: -2.2443 2.9808 -0.5183
dipole: 3.7671
quadrupole: -103.4902 -112.2531 -128.5243
quadrupole: -7.9778 0.1192 -0.2617
quadrupole: 11.2657 2.5028 -13.7685 -7.9778 0.1192 -0.2617
hfenergy: -1159.5655563 hartree
pointgroup: C01 [X(C13H15N1O8)]
dipole: 0.8891797 1.0726928 0.5052602 debye
polarizability: 263.5108682|-0.0686504|194.4437735|-12.5056995|6.6603734|114.6342476 unknown
InChI: InChI=1S/C13H15NO8/c1-6-8(12(19)21-4-10(15)16)3-9(7(2)14-6)13(20)22-5-11(17)18/h14-15,17H,3-5H2,1-2H3
charge 0 multiplicity 1
37 atoms
O  3.389983 -0.294899 0.368883
O  -2.957337 -1.050768 0.435014
O  1.843052 -1.937956 -0.263761
O  -3.875736 1.065852 0.828289
O  6.37695 -1.446189 -1.389204
O  -6.206781 -2.110713 -0.899784
O  4.920566 0.298003 -1.898644
O  -4.524033 -0.867584 -1.927106
N  0.197947 2.516953 0.420442
C  -0.39219 -0.278902 0.197484
C  1.034467 0.282344 0.214589
C  -1.45723 0.782544 0.470641
C  1.286634 1.641322 0.281763
C  -1.141165 2.126843 0.551546
C  2.627461 2.342292 0.209188
C  -2.115404 3.263639 0.768811
C  2.065467 -0.741197 0.062518
C  -2.852244 0.36333 0.596996
C  4.465292 -1.217259 0.019412
C  -4.318218 -1.574078 0.451251
C  5.229106 -0.673187 -1.181123
C  -4.970262 -1.449499 -0.923044
H  -0.589674 -0.773263 -0.773844
H  -0.475788 -1.096945 0.936653
H  0.401358 3.516621 0.44802
H  3.18653 2.223225 1.153361
H  2.491702 3.422849 0.014968
H  3.260041 1.913132 -0.583278
H  -1.601897 4.24187 0.724125
H  -2.622088 3.169561 1.744143
H  -2.920063 3.242143 0.016013
H  5.142751 -1.304252 0.884565
H  4.052783 -2.21644 -0.221462
H  -4.240616 -2.6358 0.732428
H  -4.946457 -1.034764 1.183846
H  6.868839 -1.109146 -2.186127
H  -6.64725 -2.023883 -1.787972
