program: Gaussian 09
title: 000128208
version: EM64L-G09RevD.01
frameworkgroup: C1[X(C14H10Cl3NO)]
method: RPBEPBE
basis: SDD
operation: Freq
keyword: #p
keyword: freq=noraman
keyword: PBEPBE/SDD
title: #p freq=noraman PBEPBE/SDD
converged: YES YES NO NO
title: Mulliken charges:
elementType: Cl Cl Cl O N C C C C C C C C C C C C C C H H H H H H H H H H
charge: -0.052460 -0.010105 -0.005347 -0.256515 0.003889 -0.143585 -0.460813 -0.544730 0.343871 0.467110 0.006626 -0.287557 -0.355704 -0.426365 -0.053489 -0.064306 -0.206048 -0.374727 -0.115404 0.234820 0.248176 0.234581 0.231267 0.244559 0.267760 0.306839 0.239900 0.259325 0.268433
chargesum: 0.00000
title: Mulliken charges with hydrogens summed into heavy atoms:
elementType: Cl Cl Cl O N C C C C C C C C C C C C C C
charge: -0.052460 -0.010105 -0.005347 -0.256515 0.003889 0.091234 0.021943 -0.068904 0.343871 0.467110 0.006626 -0.019797 -0.048865 -0.186465 -0.053489 -0.064306 0.053277 -0.106294 -0.115404
polarizability: 2.99747064e+02 6.34357146e+00 1.80837789e+02 3.25775530e+00 -2.26172848e-01 9.28635338e+01
1716.lowfreq: -5.4016 -0.5073 -0.0017 -0.0013 -0.0010 6.0350 14.5164 23.5885 46.2050
frequency: 14.3972 23.5150 46.1995 80.9373 126.0772 139.2202 157.3318 173.5819 184.9347 200.7560 216.5361 240.7750 324.8119 339.0515 349.3515 385.2312 413.8274 423.2106 436.4485 445.2625 464.8684 472.1198 518.5254 540.0744 581.7439 605.6102 624.3798 659.9145 692.3191 713.5667 738.2346 748.2830 814.4188 835.1405 863.7903 878.5519 894.8678 908.4167 916.5613 930.7227 951.9521 986.1694 1005.2160 1045.3591 1064.1295 1097.2369 1117.8112 1139.3156 1143.9548 1168.3774 1198.5744 1213.1981 1229.4235 1249.5786 1255.5399 1287.1922 1316.2009 1318.4265 1334.0739 1346.0337 1375.0391 1383.3605 1391.7840 1417.0112 1455.4380 1458.8904 1463.1369 1537.0669 1572.3831 1584.1422 1600.8132 2963.9791 2975.5645 3009.2590 3043.6064 3075.3252 3131.5150 3151.9903 3156.9318 3170.7380 3184.1004
redmass: 6.0918 14.1532 10.2918 8.7365 6.7005 3.7075 10.3898 6.5263 17.6584 13.0579 3.5236 3.7568 5.2264 8.7741 8.6070 6.2396 3.6174 7.5268 3.6430 3.4196 7.3119 5.2931 5.1906 3.6078 5.1174 3.1195 9.2438 7.2627 4.5295 4.0054 5.6168 6.5868 1.4860 2.1463 5.6311 2.7502 1.4880 1.4048 1.4655 3.0319 1.3571 3.0774 5.0323 2.6479 2.6412 2.0239 2.0021 3.8897 1.5939 1.3504 1.4101 1.7826 3.0009 1.3485 1.4598 1.3845 2.1898 1.5736 2.3190 1.9071 5.3770 2.7744 4.5134 2.2566 1.1205 1.3460 1.8951 6.8634 8.0192 7.3273 6.6528 1.0836 1.0653 1.0622 1.0951 1.1031 1.0899 1.0932 1.0935 1.0954 1.0923
irintensity: 1.2997 0.3535 0.3682 0.0093 1.1430 2.5109 0.7723 0.2900 0.0619 0.4179 0.1744 0.3727 1.7778 5.8737 0.6666 9.2997 1.7901 1.1279 1.1054 9.4917 7.0543 3.3528 0.9133 4.0041 12.5332 1.6815 37.1031 11.0713 6.1418 10.8481 19.0438 13.1964 41.2669 12.2438 31.2598 4.3754 29.0299 3.5047 10.1029 51.7590 0.4646 50.8175 34.4064 33.4482 53.9110 1.1645 28.1823 71.7961 39.0945 5.7026 31.2373 9.7309 318.5650 0.5651 53.0151 4.9215 4.4417 18.1443 9.7889 28.3809 15.3039 45.9017 23.1247 263.1155 13.2396 33.9992 62.1599 32.8313 14.6376 1.6710 3.4535 20.1063 27.4592 18.6735 19.9123 23.4974 9.0862 1.9041 7.8988 2.5131 3.8536
temp: 298.150 k
press: 1.00000 atm
elementType: 17 17 17 8 7 6 6 6 6 6 6 6 6 6 6 6 6 6 6 1 1 1 1 1 1 1 1 1 1
symmnumber: 1
zpe: 536485.7 jmol-1
zpe.correction: 0.204337 hartree
zpe.thermalcorrener: 0.220797 hartree
zpe.thermalcorrenthalpy: 0.221741 hartree
zpe.thermalcorrgfe: 0.157318 hartree
zpe.sumelectzpe: -2048.296003 hartree
zpe.sumelectthermal: -2048.279542 hartree
zpe.sumelectthermalent: -2048.278598 hartree
zpe.sumelectthermalfe: -2048.343022 hartree
dipole: 1.4251 -5.9197 1.0337
dipole: 6.1759
quadrupole: -149.0559 -121.1126 -131.9764
quadrupole: 0.8567 4.2371 1.3409
quadrupole: -15.0076 12.9357 2.0719 0.8567 4.2371 1.3409
hfenergy: -2048.5003392 hartree
pointgroup: C01 [X(C14H10Cl3N1O1)]
dipole: -0.4584156 -2.3840403 -0.1003822 debye
polarizability: 299.6672361|-0.4773888|179.0197278|9.7134858|-11.3721655|94.7614227 unknown
InChI: InChI=1S/C14H10Cl3NO/c15-10-5-9-2-4-13(19-14(9)18-7-10)8-1-3-11(16)12(17)6-8/h1,3,5-7,13H,2,4H2
charge 0 multiplicity 1
29 atoms
Cl -6.450266 0.613569 -0.529272
Cl 3.971359 2.691185 -0.901356
Cl 6.198182 0.456639 0.038141
O  -0.572642 0.486263 0.425565
N  -2.593265 1.587723 0.378887
C  0.180025 -0.795246 0.433899
C  -0.282821 -1.698725 -0.733297
C  -1.779504 -2.038347 -0.569236
C  -2.583767 -0.776728 -0.294922
C  1.65723 -0.444969 0.365872
C  -1.948312 0.415659 0.166433
C  -3.977868 -0.708292 -0.506767
C  2.087951 0.800815 -0.143028
C  2.620708 -1.396714 0.781442
C  -4.653238 0.503987 -0.267139
C  3.465112 1.080867 -0.246335
C  3.997591 -1.115348 0.676054
C  -3.935035 1.638061 0.163848
C  4.422127 0.126157 0.157363
H  -0.040374 -1.303069 1.396842
H  -0.101705 -1.165104 -1.685049
H  0.328848 -2.618255 -0.746842
H  -1.90982 -2.756412 0.265711
H  -2.162731 -2.539494 -1.476854
H  -4.524306 -1.587316 -0.864214
H  1.349757 1.552045 -0.433703
H  2.30393 -2.360377 1.19723
H  4.74589 -1.845187 0.997854
H  -4.431353 2.597509 0.339276
