program: Gaussian 09
title: 000128207
version: EM64L-G09RevD.01
frameworkgroup: C1[X(C14H10BrCl2NO)]
method: RPBEPBE
basis: SDD
operation: Freq
keyword: #p
keyword: freq=noraman
keyword: PBEPBE/SDD
title: #p freq=noraman PBEPBE/SDD
converged: YES YES NO NO
title: Mulliken charges:
elementType: Br Cl Cl O N C C C C C C C C C C C C C C H H H H H H H H H H
charge: 0.012448 -0.009846 -0.005051 -0.255249 0.002364 -0.145857 -0.461044 -0.542370 0.331489 0.469140 0.001544 -0.275391 -0.354552 -0.427664 -0.141241 -0.064817 -0.205583 -0.337184 -0.115453 0.235267 0.234630 0.247953 0.231631 0.245221 0.261779 0.306113 0.240074 0.259382 0.262270
chargesum: 0.00000
title: Mulliken charges with hydrogens summed into heavy atoms:
elementType: Br Cl Cl O N C C C C C C C C C C C C C C
charge: 0.012448 -0.009846 -0.005051 -0.255249 0.002364 0.089410 0.021539 -0.065518 0.331489 0.469140 0.001544 -0.013612 -0.048439 -0.187591 -0.141241 -0.064817 0.053799 -0.074915 -0.115453
polarizability: 3.23229852e+02 5.97714023e+00 1.81845737e+02 -3.84671291e+00 1.00534174e+00 9.41166306e+01
1716.lowfreq: -5.1773 -0.0016 -0.0014 0.0023 0.9610 4.0718 14.6639 21.2256 43.0196
frequency: 14.3641 20.9716 43.0162 75.7082 119.7947 139.6829 141.2644 163.2333 178.8093 187.6156 211.3910 233.4022 289.6897 322.8857 337.7861 372.5628 411.3667 422.5664 432.4167 444.3268 456.7849 471.9825 519.0707 540.6010 581.2686 604.6901 612.8310 659.1793 692.2312 713.2674 735.9427 746.0689 814.6927 832.6599 853.1176 878.2730 899.6847 913.5674 917.1524 931.0411 952.0453 984.5542 1005.1566 1044.7226 1063.2192 1094.1828 1117.4261 1137.2651 1143.8518 1168.6295 1198.4810 1212.7614 1229.7950 1249.2474 1258.3817 1286.9555 1315.2714 1319.3916 1332.5475 1345.7924 1375.0722 1383.3663 1387.6609 1416.5728 1455.1938 1458.9089 1463.0273 1530.8356 1572.3428 1578.7999 1600.7638 2964.6585 2975.3846 3009.2218 3044.0189 3075.4509 3131.9585 3150.3534 3157.8478 3171.0043 3183.7548
redmass: 6.4105 13.3527 10.7608 8.5206 7.6226 3.7909 10.3019 5.5928 11.0314 22.2379 4.3007 3.2666 11.4544 5.0982 6.9384 6.7109 3.6028 7.1287 3.7563 3.4136 6.2551 5.2432 5.2201 3.6132 5.1880 3.1495 8.9490 7.1829 4.5268 4.0336 5.5710 6.6935 1.4865 2.3432 4.7238 2.7675 1.4869 1.4220 1.5038 2.7629 1.3573 3.0402 5.0336 2.7032 2.6177 2.1565 1.9962 4.3744 1.5334 1.3447 1.4075 1.7747 2.8623 1.3513 1.4786 1.3925 2.7037 1.4812 2.1761 1.8198 5.5505 2.8916 3.8878 2.1758 1.1226 1.3769 1.8393 6.6380 8.0217 7.2897 6.6499 1.0835 1.0655 1.0622 1.0951 1.1031 1.0899 1.0931 1.0934 1.0954 1.0923
irintensity: 1.0071 0.6335 0.3685 0.0184 0.6660 2.8952 0.9129 0.3237 0.1384 0.4211 0.2175 0.3723 4.4321 1.5892 0.4690 3.1215 0.9482 1.6736 1.0305 9.7340 10.7641 2.7702 1.2736 4.5107 14.4039 1.5821 33.4555 12.1975 6.3242 10.8447 22.5955 11.1787 41.3392 17.7469 28.6727 4.0597 27.6955 7.7841 7.6539 47.4351 0.3928 46.8409 36.0815 40.4911 51.5839 2.3521 29.3160 89.9842 28.5356 6.5531 32.2864 9.8419 365.8216 0.2872 57.3570 5.3461 3.5398 17.1096 14.8229 25.8512 14.3887 53.7281 10.5417 268.8135 11.7450 34.6600 62.7404 45.1238 14.0043 2.7754 3.3383 19.8135 27.4364 18.9888 19.5554 23.7951 8.9950 2.8771 8.4759 2.5053 3.8136
temp: 298.150 k
press: 1.00000 atm
elementType: 35 17 17 8 7 6 6 6 6 6 6 6 6 6 6 6 6 6 6 1 1 1 1 1 1 1 1 1 1
symmnumber: 1
zpe: 535226.2 jmol-1
zpe.correction: 0.203857 hartree
zpe.thermalcorrener: 0.220557 hartree
zpe.thermalcorrenthalpy: 0.221502 hartree
zpe.thermalcorrgfe: 0.155813 hartree
zpe.sumelectzpe: -1601.695794 hartree
zpe.sumelectthermal: -1601.679093 hartree
zpe.sumelectthermalent: -1601.678149 hartree
zpe.sumelectthermalfe: -1601.743838 hartree
dipole: -1.2732 5.9410 1.0992
dipole: 6.1745
quadrupole: -151.6796 -123.2749 -134.9926
quadrupole: 5.8997 -3.8165 -1.1252
quadrupole: -15.0305 13.3741 1.6564 5.8997 -3.8165 -1.1252
hfenergy: -1601.8996508 hartree
pointgroup: C01 [X(C14H10Br1Cl2N1O1)]
dipole: -0.4572209 -2.3832477 -0.1108176 debye
polarizability: 322.762812|-2.5606629|180.2071273|12.7092015|-11.4255674|96.2222799 unknown
InChI: InChI=1S/C14H10BrCl2NO/c15-10-5-9-2-4-13(19-14(9)18-7-10)8-1-3-11(16)12(17)6-8/h1,3,5-7,13H,2,4H2
charge 0 multiplicity 1
29 atoms
Br -6.582002 0.631906 -0.554445
Cl 3.967942 2.691424 -0.91344
Cl 6.203025 0.467958 0.032188
O  -0.565476 0.477994 0.440639
N  -2.585584 1.579405 0.396304
C  0.189614 -0.802551 0.436516
C  -0.274718 -1.697802 -0.736371
C  -1.771242 -2.039335 -0.573212
C  -2.575357 -0.778725 -0.293511
C  1.665668 -0.448049 0.366967
C  -1.93972 0.409142 0.177543
C  -3.968959 -0.706801 -0.510025
C  2.091741 0.797419 -0.146728
C  2.632621 -1.395049 0.785013
C  -4.64865 0.504138 -0.265755
C  3.467779 1.081905 -0.252218
C  4.00848 -1.109288 0.6774
C  -3.926276 1.63337 0.17738
C  4.428377 0.13181 0.154031
H  -0.027143 -1.318001 1.396119
H  0.337502 -2.616842 -0.75682
H  -0.095161 -1.157687 -1.684755
H  -1.900777 -2.760652 0.259065
H  -2.154564 -2.537121 -1.4826
H  -4.510338 -1.585727 -0.875555
H  1.350903 1.545464 -0.438982
H  2.319461 -2.35826 1.204538
H  4.759527 -1.835402 1.001207
H  -4.418474 2.593455 0.359908
