program: Gaussian 09
title: 000128246
version: EM64L-G09RevD.01
frameworkgroup: C1[X(C27H29NO)]
method: RPBEPBE
basis: SDD
operation: Freq
keyword: #p
keyword: freq=noraman
keyword: PBEPBE/SDD
title: #p freq=noraman PBEPBE/SDD
converged: YES YES NO NO
title: Mulliken charges:
elementType: O N C C C C C C C C C C C C C C C C C C C C C C C C C C C H H H H H H H H H H H H H H H H H H H H H H H H H H H H H
charge: -0.265280 -0.074799 -0.383118 -0.614057 -0.636568 0.154275 0.132273 0.318273 0.178777 0.282323 0.332640 -0.440709 -0.389227 -0.246127 -0.252784 -0.379691 -0.410178 -0.428973 -0.404218 -0.385315 -0.366795 0.328564 -0.239807 -0.229479 -0.250755 -0.286204 -0.435721 -0.613352 -0.613990 0.214362 0.219230 0.219174 0.238718 0.215040 0.230747 0.234540 0.260439 0.224610 0.226550 0.258469 0.252564 0.233415 0.253475 0.249041 0.244194 0.222697 0.224233 0.226882 0.215881 0.217403 0.230714 0.231072 0.223993 0.187264 0.226997 0.187396 0.224059 0.226861
chargesum: 0.00000
title: Mulliken charges with hydrogens summed into heavy atoms:
elementType: O N C C C C C C C C C C C C C C C C C C C C C C C C C C C
charge: -0.265280 -0.074799 0.050473 -0.156166 -0.190781 0.154275 0.132273 0.318273 0.178777 0.282323 0.332640 -0.206169 -0.128788 -0.021517 -0.026234 -0.121223 -0.157614 -0.195558 -0.150742 -0.136273 -0.122600 0.328564 -0.017110 -0.005246 -0.023873 0.147080 0.026065 0.024903 0.024325
polarizability: 3.70161301e+02 -2.50121156e+00 3.78481346e+02 -3.13377326e+00 -4.42482148e+00 2.16116750e+02
1716.lowfreq: -18.7477 -7.4006 -1.9470 -0.0006 -0.0005 0.0004 5.8529 11.5206 30.8043
frequency: -16.3383 9.2187 30.7827 38.4466 46.8710 54.0827 58.6446 73.8733 83.0737 98.1262 124.0700 139.5024 149.4925 154.8209 187.7607 191.1943 204.0270 215.5103 226.2868 230.1647 243.9843 259.8853 311.8922 330.9737 340.1751 349.3818 383.6881 393.2581 406.1942 409.0662 416.5086 430.0538 452.6143 470.1210 479.3763 505.3874 511.1759 532.9993 569.8094 591.9968 598.3372 615.6906 624.1256 634.1530 667.1484 688.1286 703.3430 720.9872 741.6886 755.7299 765.5433 776.5679 786.2162 795.7660 799.0178 814.0161 822.6972 825.7469 841.8463 851.1176 876.1166 882.8355 913.9600 920.5310 946.4338 953.0832 971.1956 975.8002 976.9851 981.4563 987.5184 988.1181 992.3569 999.8889 1005.7661 1026.1394 1031.5637 1038.3862 1045.2118 1053.3053 1054.5201 1058.2707 1074.9544 1083.7399 1089.7565 1104.1567 1120.2186 1136.5517 1155.1648 1167.7790 1168.9312 1171.2201 1173.5290 1177.8497 1186.5416 1192.5520 1211.1965 1224.3911 1244.2711 1256.5026 1272.4903 1284.8576 1290.3245 1295.2636 1304.1482 1308.9751 1315.8939 1317.8288 1327.2566 1330.3208 1345.3167 1356.8267 1369.8516 1372.2077 1376.0703 1419.9132 1421.0104 1431.2638 1434.4369 1436.2481 1454.3723 1455.3531 1459.1115 1467.5606 1467.9229 1472.4374 1478.5829 1479.2619 1480.9616 1482.6705 1497.6316 1498.0578 1562.1607 1569.2966 1575.9352 1588.1190 1604.2768 1607.0727 1615.4148 2849.5638 2860.6617 2951.5088 2975.7289 2982.9189 2993.4459 2994.9741 3007.3230 3007.4471 3010.2541 3032.5126 3049.0387 3060.4926 3061.1242 3069.8915 3072.1623 3113.6325 3118.8398 3125.9502 3126.6936 3132.2072 3139.1180 3140.8673 3146.1840 3149.0533 3159.0582 3159.4569 3163.2424 3168.9416
redmass: 2.7692 4.3351 4.3193 4.5950 4.3101 4.2487 3.9355 3.8915 4.1940 3.5826 3.4573 4.1445 2.4492 3.1214 3.9119 2.9231 3.7922 2.0059 1.5473 1.1308 5.0210 3.4126 4.0731 4.3795 3.3903 3.3842 3.3886 2.8732 2.8553 2.0424 2.9482 2.7648 4.5673 4.4823 3.1877 3.8877 3.7330 3.0564 3.8497 4.2817 4.5986 6.3563 4.4304 5.7292 5.7377 4.3294 1.6319 2.8929 2.6489 1.8057 2.3489 2.2023 2.7159 1.2725 3.0668 2.5690 1.3622 3.9551 1.6594 1.2500 1.9534 1.9091 3.9250 1.4760 1.3688 1.4052 1.4243 1.4558 2.2565 4.8854 1.3299 4.9888 1.4052 2.7718 2.4809 2.2333 4.4297 2.2854 1.3329 2.4873 2.0288 1.8843 1.9424 1.9041 1.2845 1.8429 1.3495 1.4119 1.3129 1.3663 1.4621 1.0698 1.1345 1.3365 1.8405 1.1200 2.2614 2.6914 1.4389 1.4950 2.4466 1.4719 2.8778 1.7342 1.2898 1.6482 1.5149 1.2625 1.4869 1.4694 1.5219 3.9048 5.4862 5.6499 1.4762 3.8182 1.1339 2.3170 2.2567 1.1204 1.0894 1.0537 1.1014 1.1970 1.0932 1.4674 1.4511 2.1830 1.2563 1.0522 1.9247 1.0924 7.1959 6.8484 6.0733 7.7660 6.0780 6.2154 6.2974 1.0571 1.0577 1.0542 1.0581 1.0626 1.0596 1.0628 1.0718 1.0752 1.1034 1.0984 1.1016 1.1020 1.1051 1.1013 1.1002 1.0866 1.0846 1.0870 1.0878 1.0881 1.0925 1.0937 1.0877 1.0956 1.1005 1.0949 1.1013 1.0969
irintensity: 0.2940 0.0132 0.0783 0.0332 0.1710 0.0740 0.1909 0.7830 0.5157 1.0305 0.5100 0.5057 0.7227 2.2712 1.7083 0.4470 0.1745 0.4086 3.9250 0.6632 1.2143 2.4728 1.4550 11.6536 2.0107 4.9340 1.5392 0.3237 0.3232 0.2481 0.2306 4.3537 1.8865 7.5909 6.9128 9.9767 9.9306 5.0482 11.0544 7.8688 12.5390 0.1752 15.2629 1.4886 0.9878 2.6584 53.9052 2.3418 3.2580 39.4766 35.3092 28.7944 22.5585 10.6926 1.9469 5.1500 0.4376 24.6037 46.2216 0.0884 0.3595 0.7042 5.2531 5.7031 0.2539 0.8323 1.5790 1.8467 34.6024 65.6519 0.3467 0.2130 0.6319 4.2936 10.7507 7.1654 5.9834 10.8884 3.7639 1.8287 67.5479 14.7492 1.1502 7.4956 13.4933 2.8439 12.7991 3.7699 4.2357 0.8340 3.0808 0.9296 20.8137 105.0920 21.9895 0.0675 1.4439 255.9361 0.3591 3.8685 16.6616 3.6616 13.2410 10.7537 1.2777 3.4444 1.6116 0.8918 4.5544 0.4025 5.0270 10.7338 1.3898 0.4142 0.5131 6.2113 5.2047 5.6251 3.1953 14.3459 8.1136 12.1992 2.0975 8.9806 76.5090 23.1532 12.9912 31.0444 44.2593 10.0993 89.6862 11.8167 0.3763 8.5960 1.6410 4.1741 9.5480 7.1702 100.3743 67.9771 153.7968 44.0850 45.6183 39.6949 35.8378 23.5932 99.8578 44.1505 7.4542 26.4009 46.3213 33.9172 19.3397 39.4760 57.6579 9.2151 5.8414 0.5048 5.0895 14.4962 24.0996 30.3596 7.3441 37.9397 37.1198 21.4926 23.4706 4.2626
temp: 298.150 k
press: 1.00000 atm
elementType: 8 7 6 6 6 6 6 6 6 6 6 6 6 6 6 6 6 6 6 6 6 6 6 6 6 6 6 6 6 1 1 1 1 1 1 1 1 1 1 1 1 1 1 1 1 1 1 1 1 1 1 1 1 1 1 1 1 1
symmnumber: 1
zpe: 1272827.3 jmol-1
zpe.correction: 0.484794 hartree
zpe.thermalcorrener: 0.510535 hartree
zpe.thermalcorrenthalpy: 0.511479 hartree
zpe.thermalcorrgfe: 0.427297 hartree
zpe.sumelectzpe: -1174.132550 hartree
zpe.sumelectthermal: -1174.106810 hartree
zpe.sumelectthermalent: -1174.105865 hartree
zpe.sumelectthermalfe: -1174.190047 hartree
dipole: 0.2539 -1.1049 1.4725
dipole: 1.8584
quadrupole: -162.1671 -162.1049 -168.3801
quadrupole: -7.1087 6.8776 -1.4976
quadrupole: 2.0502 2.1125 -4.1627 -7.1087 6.8776 -1.4976
hfenergy: -1174.6173442 hartree
pointgroup: C01 [X(C27H29N1O1)]
dipole: 0.0033538 -0.2621456 -0.6825295 debye
polarizability: 369.3941573|1.8138219|363.9720551|-5.0924321|47.5201376|231.3931839 unknown
InChI: InChI=1S/C27H29NO/c1-28(2)19-20-29-24-17-15-23(16-18-24)27-25-13-7-6-11-22(25)12-8-14-26(27)21-9-4-3-5-10-21/h3-7,9-11,13,15-18H,8,12,14,19-20H2,1-2H3
charge 0 multiplicity 1
58 atoms
O  -3.92894 -0.3788 0.638169
N  -7.173258 -1.65124 -0.800254
C  4.688628 1.323445 -0.768223
C  3.996499 1.269687 0.623911
C  4.003628 0.35346 -1.772943
C  2.470486 1.303556 0.530741
C  1.786594 0.140486 0.206717
C  3.632919 -0.986099 -1.157309
C  2.551396 -1.078464 -0.218862
C  0.29899 0.001181 0.299444
C  1.813104 2.629522 0.743828
C  4.329088 -2.163832 -1.524423
C  2.200745 -2.356663 0.298234
C  3.983074 -3.423418 -0.986623
C  2.909873 -3.518332 -0.070334
C  -0.43659 0.524808 1.40253
C  -0.4284 -0.69763 -0.700133
C  2.188479 3.472578 1.828148
C  0.833867 3.116737 -0.16878
C  -1.830466 0.381226 1.487992
C  -1.830878 -0.84699 -0.634525
C  -2.537856 -0.298254 0.46398
C  1.594894 4.741275 2.006559
C  0.247473 4.387525 0.001951
C  0.62145 5.20757 1.093192
C  -4.714728 -1.087315 -0.384855
C  -6.191495 -0.982797 0.07074
C  -7.12036 -3.121619 -0.810743
C  -7.363748 -1.049145 -2.128907
H  5.756003 1.056204 -0.638716
H  4.653565 2.350605 -1.180287
H  4.364179 2.114231 1.233484
H  4.312697 0.336356 1.127503
H  4.659889 0.20235 -2.650014
H  3.080051 0.84538 -2.135834
H  5.150097 -2.08914 -2.248355
H  1.365375 -2.428522 1.003414
H  4.538508 -4.320398 -1.283426
H  2.628709 -4.489295 0.352644
H  0.098751 1.044219 2.203506
H  0.112833 -1.13035 -1.549098
H  2.931329 3.122504 2.554735
H  0.540475 2.489654 -1.017277
H  -2.39207 0.781403 2.337673
H  -2.352296 -1.386314 -1.430905
H  1.890977 5.364468 2.8583
H  -0.499662 4.740852 -0.717962
H  0.163888 6.194209 1.227071
H  -4.564319 -0.607592 -1.373865
H  -4.384895 -2.145056 -0.444272
H  -6.268784 -1.409907 1.088211
H  -6.453409 0.089238 0.148082
H  -8.050048 -3.520467 -1.257875
H  -6.262805 -3.552637 -1.387167
H  -7.054941 -3.496973 0.226435
H  -6.535781 -1.251737 -2.85471
H  -8.296919 -1.436785 -2.578685
H  -7.466163 0.046445 -2.027732
