program: Gaussian 09
title: 000128159
version: EM64L-G09RevD.01
frameworkgroup: C1[X(C6H8O4)]
method: RPBEPBE
basis: SDD
operation: Freq
keyword: #p
keyword: freq=noraman
keyword: PBEPBE/SDD
title: #p freq=noraman PBEPBE/SDD
converged: YES YES NO NO
title: Mulliken charges:
elementType: O O O O C C C C C C H H H H H H H H
charge: -0.412732 -0.437832 -0.227129 -0.257865 -0.659850 0.306089 -0.206111 0.203978 0.109289 -0.739425 0.308442 0.263801 0.264367 0.229021 0.261875 0.230087 0.379192 0.384803
chargesum: 0.00000
title: Mulliken charges with hydrogens summed into heavy atoms:
elementType: O O O O C C C C C C
charge: -0.033540 -0.053029 -0.227129 -0.257865 -0.087607 0.306089 0.058256 0.203978 0.109289 -0.018442
polarizability: 8.51715989e+01 -2.92424398e+00 9.39315169e+01 4.36862229e+00 5.67943788e+00 5.51501233e+01
1716.lowfreq: -7.9739 -3.3309 -0.0001 0.0004 0.0007 10.3180 34.0085 47.2172 67.7117
frequency: 33.9144 47.1464 67.7047 107.3496 142.4855 204.6117 225.2156 288.2240 351.4305 406.2413 431.1052 484.1532 521.5093 560.8722 580.0234 619.5331 639.4451 704.7903 795.1455 855.4972 880.5768 915.4126 1019.0411 1023.4277 1051.2556 1053.8631 1090.3379 1166.3150 1210.0260 1252.6195 1325.6579 1336.5751 1382.3219 1396.3963 1436.6422 1457.2533 1470.6019 1619.6555 1667.8796 1673.4245 2975.3414 3005.0156 3053.7077 3060.5450 3090.8450 3139.4759 3515.4139 3539.2067
redmass: 6.4318 5.5139 10.2289 1.5376 2.1418 3.7802 2.8798 2.5148 6.6637 4.0734 3.3233 2.2174 4.1731 1.8755 1.9801 3.4066 1.4427 4.3083 3.5496 4.5303 1.3619 2.0091 2.8839 2.4446 1.7608 1.9463 2.3377 1.6926 1.2130 1.5584 2.4712 1.4703 1.6576 1.4677 1.1476 1.0568 1.0804 8.3388 6.9587 8.2719 1.0386 1.0611 1.0938 1.0974 1.0992 1.0910 1.0641 1.0643
irintensity: 0.5697 0.9534 0.8174 2.9581 1.4961 1.2054 1.2894 4.0299 0.3716 10.2210 17.3397 10.9768 49.9187 112.5091 79.9908 27.4107 112.8038 53.4630 41.5364 0.3871 11.4443 8.0644 12.7351 160.5753 139.9996 181.2111 73.8688 35.1415 2.5427 0.7895 123.4161 19.0543 21.6147 25.7316 28.0009 35.3400 25.3980 221.9915 148.2008 153.4351 7.9417 13.0575 16.7084 4.1533 20.4646 4.7314 25.3258 42.2459
temp: 298.150 k
press: 1.00000 atm
elementType: 8 8 8 8 6 6 6 6 6 6 1 1 1 1 1 1 1 1
symmnumber: 1
zpe: 352152.1 jmol-1
zpe.correction: 0.134128 hartree
zpe.thermalcorrener: 0.145015 hartree
zpe.thermalcorrenthalpy: 0.145959 hartree
zpe.thermalcorrgfe: 0.096143 hartree
zpe.sumelectzpe: -533.569541 hartree
zpe.sumelectthermal: -533.558654 hartree
zpe.sumelectthermalent: -533.557710 hartree
zpe.sumelectthermalfe: -533.607526 hartree
dipole: -0.4582 2.1687 -0.9461
dipole: 2.4100
quadrupole: -46.9782 -59.0038 -61.6296
quadrupole: 1.9181 2.0892 -3.3454
quadrupole: 8.8923 -3.1333 -5.7590 1.9181 2.0892 -3.3454
hfenergy: -533.7036689 hartree
pointgroup: C01 [X(C6H8O4)]
dipole: 0.0104384 -0.9284204 -0.1923134 debye
dipolederiv: -1.1865606 -0.2375202 0.4094014 -0.183135 -0.4577589 0.0598484 0.2952829 0.0313119 -0.3898905 -1.2489293 0.0413495 0.241915 -0.0996138 -0.2695068 0.0024349 0.310948 -0.0482297 -0.506245 -0.6368878 -0.0494066 -0.0845009 -0.1161779 -0.3245151 0.1045862 0.1291133 0.1199602 -0.913775 -0.6468935 0.1041164 0.0471099 -0.0941671 -1.0825479 0.2350252 0.137309 0.1513694 -0.4147331 -0.2043754 -0.0121471 -0.0972194 0.1024505 0.0593746 0.0649774 -0.2506563 0.0453138 -0.1504745 0.0734704 0.2460328 -0.0692434 0.3270294 -0.7347604 0.1001137 -0.1332568 0.1102288 -0.1008524 0.0249483 -0.1462237 -0.0270953 -0.1992233 0.5594906 -0.1260217 0.0201393 -0.2295598 -0.0424701 1.5722224 0.2962268 -0.1141275 0.2554415 0.2735238 -0.2343271 -0.1022039 -0.1739178 1.1929685 1.4381847 -0.4595429 -0.2639091 -0.0626339 1.4586785 -0.3005638 -0.4008993 -0.1486287 0.4119856 -0.0187059 0.1808723 -0.0322083 0.1339042 -0.2369007 0.0513475 -0.059647 0.2172451 -0.0085625 0.1479867 -0.0107798 -0.0351336 -0.1021373 0.0496399 0.0487945 0.0003118 0.0140944 0.1259157 0.0196249 0.0129836 0.0368457 0.0272893 0.0466179 -0.1113416 0.042574 -0.0542073 0.0495593 -0.0190508 0.0171502 0.0545 -0.0157357 0.0817218 0.0133447 0.0705992 0.0124803 0.126405 -0.0582835 0.0171029 0.1041914 -0.0224816 0.0703282 0.0449033 0.1324245 -0.0318574 0.0181449 0.0986393 0.0808928 -0.064266 0.0262043 0.0802152 0.0154187 -0.0464479 0.0029127 -0.0407463 0.0147862 -0.0845187 -0.0373442 -0.0774492 -0.0788309 -0.0447674 -0.0158074 -0.112028 0.119524 0.2758953 -0.0049284 -0.0853787 0.0177287 0.3751949 0.0404246 -0.1254559 0.0282275 0.140652 0.3539286 0.0083401 0.0164627 0.0827069 0.1300354 0.0358025 -0.0043274 0.0652846 0.3825943 unknown
polarizability: 84.4313301|-2.0071592|91.3428548|-4.9676322|-12.0264888|58.4790542 unknown
InChI: InChI=1S/C6H8O4/c1-2-4(6(9)10)3-5(7)8/h2,7,9H,3H2,1H3
charge 0 multiplicity 1
18 atoms
O  3.04617 0.360554 -0.462039
O  -2.871151 0.564257 0.257838
O  1.742819 -0.23965 1.362383
O  -1.355917 2.061273 -0.659864
C  0.705338 0.078491 -0.88623
C  -0.664502 -0.251729 -0.327609
C  -1.037774 -1.487715 0.12388
C  1.822973 0.035839 0.147862
C  -1.611463 0.890742 -0.273403
C  -0.171469 -2.716058 0.154279
H  0.693449 1.095253 -1.319973
H  0.9919 -0.605229 -1.707616
H  -2.05465 -1.58901 0.524173
H  0.713624 -2.638098 -0.499224
H  0.196425 -2.883168 1.186447
H  -0.749433 -3.613206 -0.133159
H  3.766801 0.34563 0.224859
H  -3.430642 1.385925 0.260597
