program: Gaussian 09
title: 000012132
version: EM64L-G09RevD.01
frameworkgroup: C1[X(C14H12N2)]
method: RPBEPBE
basis: SDD
operation: Freq
keyword: #pfreq=noraman
keyword: PBEPBE/SDD
title: #p freq=noraman PBEPBE/SDD
converged: YES YES NO NO
title: Mulliken charges:
elementType: N N C C C C C C C C C C C C C C H H H H H H H H H H H H
charge: -0.453098 -0.054101 -0.633296 0.159883 0.290472 -0.010417 0.462007 -0.377838 -0.344125 -0.368830 -0.444112 -0.215149 -0.234188 -0.221211 -0.221578 -0.246446 0.232262 0.258192 0.320086 0.232402 0.248048 0.247421 0.236574 0.222837 0.224574 0.229370 0.228696 0.231567
chargesum: 0.00000
title: Mulliken charges with hydrogens summed into heavy atoms:
elementType: N N C C C C C C C C C C C C C C
charge: -0.133012 -0.054101 -0.142842 0.159883 0.290472 -0.010417 0.462007 -0.145436 -0.096077 -0.121409 -0.207538 0.007688 -0.009614 0.008160 0.007118 -0.014879
polarizability: 2.26863432e+02 4.16996511e+00 1.36118821e+02 2.09009305e+01 2.63808467e+00 1.13176001e+02
1716.lowfreq: -6.9796 -0.0008 -0.0007 -0.0002 7.1159 11.1628 24.3355 29.9207 50.4025
frequency: 23.5494 29.7383 50.3307 135.4511 182.3541 247.2236 253.2142 298.9563 325.7537 404.7022 429.8060 444.3124 468.1750 522.8806 578.4090 589.6746 612.9820 615.4719 623.4565 658.5273 696.8083 713.3185 754.3525 760.6449 772.1489 811.0201 828.0798 857.5695 858.3607 878.8535 911.3103 935.8380 945.4051 969.4194 975.9375 980.6898 990.5257 998.8168 1008.1926 1027.2707 1082.8885 1109.6128 1158.9112 1164.3171 1173.5167 1189.1504 1199.2903 1212.1012 1221.7689 1257.6750 1292.9609 1304.4311 1336.2471 1364.1091 1382.3977 1413.5619 1440.5823 1444.3642 1458.1424 1475.1814 1485.0811 1520.9987 1593.4108 1593.9479 1614.4119 1634.3132 2987.1001 3051.3180 3116.9036 3122.0633 3129.0977 3135.3144 3141.6544 3146.7224 3156.8439 3164.5401 3170.7387 3589.3550
redmass: 4.3410 3.9466 5.1570 4.8409 4.7905 4.4690 4.6423 4.2040 2.6180 2.8278 3.0064 3.6033 3.8795 5.5725 3.9168 4.5454 5.2354 4.7805 1.4249 3.8971 3.9354 1.6322 1.3410 2.3017 3.6431 3.7090 4.1960 1.4645 1.2878 5.2682 1.5301 1.3831 1.9071 5.3534 1.3038 1.3889 6.2111 1.3147 2.1066 2.2127 1.5886 1.6338 1.1493 1.2744 1.0615 1.1196 2.3750 2.4472 1.5042 2.6159 1.9751 1.9234 1.3236 2.9206 7.5058 2.8958 2.1221 3.3622 1.1574 3.4421 2.2468 5.2196 6.0595 6.9250 6.0961 7.4939 1.0641 1.0958 1.0875 1.0868 1.0853 1.0911 1.0904 1.0959 1.0957 1.1015 1.0993 1.0813
irintensity: 2.5412 0.1552 0.2883 3.5838 2.2531 2.0795 5.3051 1.2806 1.7392 0.2579 8.9108 0.4000 18.2024 4.4093 1.6973 3.9121 4.2599 4.4613 61.2055 13.9739 4.8867 66.7669 117.0676 32.4273 4.3251 2.7503 2.5305 0.2417 0.0067 1.2275 2.3957 3.7749 1.7249 1.3253 0.0540 0.0437 0.3861 0.4150 7.5810 8.2307 11.4910 4.5842 2.6684 11.2834 0.4308 1.9482 11.0285 1.7803 9.5825 27.7215 24.0830 9.5691 3.1282 57.2105 0.9204 3.0100 5.2853 47.9971 17.6932 0.4601 17.2196 78.5392 0.8279 1.6582 7.9161 10.5288 19.6278 3.2831 8.1385 3.1943 0.3095 9.9389 12.1123 36.9680 25.4592 23.7412 21.8047 41.6167
temp: 298.150 k
press: 1.00000 atm
elementType: 7 7 6 6 6 6 6 6 6 6 6 6 6 6 6 6 1 1 1 1 1 1 1 1 1 1 1 1
symmnumber: 1
zpe: 587393.7 jmol-1
zpe.correction: 0.223726 hartree
zpe.thermalcorrener: 0.235957 hartree
zpe.thermalcorrenthalpy: 0.236901 hartree
zpe.thermalcorrgfe: 0.183106 hartree
zpe.sumelectzpe: -649.110383 hartree
zpe.sumelectthermal: -649.098152 hartree
zpe.sumelectthermalent: -649.097208 hartree
zpe.sumelectthermalfe: -649.151003 hartree
dipole: -2.2919 -2.5510 -1.4603
dipole: 3.7273
quadrupole: -85.5261 -92.9190 -90.1489
quadrupole: -1.1710 3.0787 -0.6311
quadrupole: 4.0052 -3.3877 -0.6175 -1.1710 3.0787 -0.6311
hfenergy: -649.334109 hartree
pointgroup: C01 [X(C14H12N2)]
dipole: 0.7990743 -1.0674594 -0.6102935 debye
polarizability: 222.0093948|-30.1612635|125.5688252|6.9296407|10.5494438|128.5800337 unknown
InChI: InChI=1S/C14H12N2/c1-2-6-11(7-3-1)10-14-15-12-8-4-5-9-13(12)16-14/h1-9,15H,10H2
charge 0 multiplicity 1
28 atoms
N  -0.631533 -0.692557 0.136154
N  -1.18545 1.182848 1.311969
C  1.174579 0.313353 1.629662
C  -0.208824 0.302084 1.032869
C  -1.970959 -0.43394 -0.189727
C  -2.30533 0.745768 0.562793
C  2.289068 -0.01108 0.635724
C  -2.896812 -1.079513 -1.03444
C  -3.603916 1.295437 0.471531
C  2.424604 0.735684 -0.564623
C  3.215732 -1.05108 0.897701
C  -4.188376 -0.51362 -1.11096
C  -4.536604 0.654029 -0.370237
C  3.46406 0.451215 -1.476329
C  4.25855 -1.338934 -0.01409
C  4.385828 -0.588176 -1.204531
H  1.215756 -0.401315 2.475441
H  1.312478 1.319574 2.06527
H  -0.037661 -1.428288 -0.243885
H  -2.639331 -1.976823 -1.607073
H  -3.864676 2.19191 1.042231
H  1.712924 1.54276 -0.778322
H  3.124431 -1.634675 1.822519
H  -4.941153 -0.982647 -1.754281
H  -5.550826 1.058307 -0.45957
H  3.558036 1.039445 -2.396143
H  4.968033 -2.144729 0.205401
H  5.193272 -0.808241 -1.911652
