program: Gaussian 09
title: 000128257
version: EM64L-G09RevD.01
frameworkgroup: C1[X(C17H23Cl6N3O2S)]
method: RPBEPBE
basis: SDD
operation: Freq
keyword: #p
keyword: freq=noraman
keyword: PBEPBE/SDD
title: #p freq=noraman PBEPBE/SDD
converged: YES YES NO NO
title: Mulliken charges:
elementType: Cl Cl Cl Cl Cl Cl S O O N N N C C C C C C C C C C C C C C C C C H H H H H H H H H H H H H H H H H H H H H H H
charge: 0.095342 0.083651 0.050936 0.060394 0.081702 0.099772 0.282687 -0.274355 -0.255579 -0.197507 -0.406408 -0.081113 -0.193395 -0.403430 0.063723 0.245787 0.266302 -0.567550 -0.663154 -0.726524 0.074347 -0.666162 -0.004942 -0.658278 -0.673013 -0.673560 -0.218388 -0.491621 -0.183208 0.254082 0.292582 0.208234 0.340668 0.259496 0.250842 0.232621 0.219221 0.243766 0.300789 0.240907 0.265045 0.245078 0.358946 0.275158 0.235667 0.263347 0.206066 0.221757 0.269562 0.216453 0.273091 0.260163
chargesum: 0.00000
title: Mulliken charges with hydrogens summed into heavy atoms:
elementType: Cl Cl Cl Cl Cl Cl S O O N N N C C C C C C C C C C C C C C C C C
charge: 0.095342 0.083651 0.050936 0.060394 0.081702 0.099772 0.282687 -0.274355 -0.255579 -0.197507 -0.047463 -0.081113 0.060687 0.097386 0.404392 0.245787 0.266302 -0.057212 -0.663154 -0.030916 0.375136 0.084868 0.270216 -0.658278 0.032068 0.034212 -0.218388 -0.218531 0.076956
polarizability: 3.36388683e+02 7.24206881e+00 2.77876209e+02 -4.90002331e+00 -1.74029694e+01 2.35805195e+02
1716.lowfreq: -5.3402 -3.0988 -0.0025 -0.0023 -0.0021 0.9181 11.5356 14.4251 17.6863
frequency: 11.4681 14.2738 17.6314 23.1844 24.8015 31.5131 39.3950 51.2435 53.6637 66.1566 81.0490 83.4870 89.0573 108.9999 110.3977 126.7656 131.3855 140.8997 150.2113 163.0204 178.7173 188.2649 192.6664 200.7963 219.0634 227.5798 231.8414 245.3135 249.0517 256.7771 264.1971 264.6789 266.0511 280.3093 293.6544 297.7850 302.8556 326.0227 351.5485 360.5357 368.5496 372.3774 386.0284 419.3000 452.3220 470.5731 488.4005 501.9895 520.9190 527.8605 545.1078 573.0446 590.1174 593.7946 613.6601 621.3194 667.3416 692.9849 695.8229 698.5292 704.2722 721.7593 727.0616 739.8969 747.9267 824.9948 844.3555 858.0113 872.5580 875.4713 886.8769 899.7388 918.2321 948.8488 963.6719 976.4838 1000.1961 1009.4627 1032.9273 1060.1690 1068.9317 1071.0958 1085.0355 1093.8982 1094.6259 1105.2488 1115.7704 1124.5372 1141.3410 1145.1638 1158.6169 1182.8136 1190.0217 1211.5950 1219.5388 1234.2754 1259.3533 1274.6696 1281.3081 1284.8502 1296.0452 1307.9573 1313.9630 1328.6604 1333.6597 1337.0889 1348.6178 1381.4794 1387.2886 1390.5327 1402.8911 1439.6547 1453.8420 1455.5997 1462.8342 1464.1369 1469.9490 1471.1231 1475.6960 1479.4642 1481.7182 1486.2230 1491.0900 1494.1819 1504.9672 1581.6237 1602.4997 2971.5402 2981.4893 2989.2163 2990.8344 2993.0599 2994.6542 3000.1143 3003.2897 3016.3308 3031.1538 3046.4616 3052.0963 3091.5663 3095.5023 3098.2713 3101.7429 3102.6428 3114.7593 3116.4255 3134.3222 3204.1456 3254.1227 3476.4866
redmass: 9.1599 11.5517 10.5775 11.8247 6.9698 10.4085 6.5019 7.5844 6.3534 3.5361 6.7550 6.4011 4.7055 1.9224 2.2295 4.6806 4.7788 2.9682 4.7593 3.5714 7.9904 7.4169 6.1533 5.6422 4.1511 1.2988 2.8799 2.0101 1.9117 2.2226 6.6288 5.2631 6.2231 4.0391 3.7816 3.9010 4.1715 9.3760 5.2421 4.8322 6.0945 5.8741 4.6524 4.1294 3.2722 3.3109 4.0950 5.1119 4.6480 4.7087 3.8949 4.5262 4.4056 4.8325 4.5339 4.6177 5.3027 2.3296 1.7731 4.8744 4.5821 8.8202 7.2447 1.2763 3.5374 4.8476 5.4725 3.2552 2.8862 1.3466 2.6546 2.4423 1.7080 1.9502 2.0684 2.0369 2.6054 2.8449 1.8634 1.9437 1.6759 1.9194 2.2229 2.4266 2.5190 2.5795 1.4908 2.3333 2.0067 2.0119 2.8413 4.0494 1.9302 1.4621 1.6945 1.3960 1.2406 1.3206 1.6769 1.7084 1.6026 1.3489 1.2476 1.2360 1.3866 1.4153 1.4500 1.2082 1.2026 1.1912 1.8108 1.1315 1.3072 1.2229 1.2821 2.5343 1.1875 1.0639 1.5910 1.0635 1.0544 1.0531 1.0717 1.0806 5.7459 6.9728 8.9122 1.0403 1.0825 1.0600 1.0658 1.0372 1.0349 1.0381 1.0802 1.0807 1.0816 1.0998 1.0997 1.0999 1.1000 1.0955 1.0990 1.0983 1.1017 1.1003 1.0946 1.0923 1.1017 1.0772
irintensity: 0.0176 0.0880 0.3451 0.0820 0.2096 0.3003 0.8215 0.9805 0.8624 7.1135 2.8462 0.0288 2.3335 0.0355 2.0964 0.5209 0.6901 1.6923 1.9018 3.0954 0.5892 3.8145 0.4301 1.5538 0.4435 0.2480 2.9875 3.3257 0.9961 0.3376 0.3591 0.2667 0.8365 11.1272 4.8445 6.1671 3.9939 12.9925 2.0313 0.4170 8.5924 28.1544 5.2121 18.1812 19.4138 15.9846 3.4722 37.6760 27.3197 16.7251 10.2159 17.0288 17.6230 40.7796 25.1080 0.4011 6.0202 174.1891 43.2813 90.7482 9.2113 105.4767 124.0068 76.6435 13.2874 27.5866 1.3055 24.7206 12.9210 2.6290 19.5129 18.8628 21.8853 29.0380 57.4578 81.1995 38.3827 77.2428 10.6857 1.5547 8.5552 11.2457 15.3931 18.0092 7.1456 21.7378 18.7526 31.0492 9.6429 15.6529 5.4109 13.2559 9.6806 14.1592 1.9774 0.7371 6.9902 33.7978 3.9517 91.1877 28.0950 10.4433 11.8459 2.7317 14.9055 2.8545 41.5634 16.6902 34.2423 19.6152 71.9820 30.7680 182.7606 30.7367 4.1314 28.9788 14.1918 21.1892 146.1978 43.2163 20.2552 17.6340 25.9863 25.8167 67.3174 155.6677 216.5679 46.8295 8.4800 14.7063 16.0679 14.5964 19.1383 14.5598 14.4935 17.4986 38.0467 22.7699 3.0707 13.5184 24.2714 2.2878 10.6070 21.5165 10.2095 12.7819 12.5829 4.8811 1.0937 82.7229
temp: 298.150 k
press: 1.00000 atm
elementType: 17 17 17 17 17 17 16 8 8 7 7 7 6 6 6 6 6 6 6 6 6 6 6 6 6 6 6 6 6 1 1 1 1 1 1 1 1 1 1 1 1 1 1 1 1 1 1 1 1 1 1 1
symmnumber: 1
zpe: 1004713.5 jmol-1
zpe.correction: 0.382675 hartree
zpe.thermalcorrener: 0.416736 hartree
zpe.thermalcorrenthalpy: 0.417680 hartree
zpe.thermalcorrgfe: 0.310757 hartree
zpe.sumelectzpe: -4132.501091 hartree
zpe.sumelectthermal: -4132.467030 hartree
zpe.sumelectthermalent: -4132.466086 hartree
zpe.sumelectthermalfe: -4132.573009 hartree
dipole: 4.3245 4.6084 5.3041
dipole: 8.2506
quadrupole: -236.5346 -222.2494 -216.4280
quadrupole: 14.2405 -8.3575 -1.7804
quadrupole: -11.4639 2.8213 8.6426 14.2405 -8.3575 -1.7804
hfenergy: -4132.883766 hartree
pointgroup: C01 [X(C17H23Cl6N3O2S1)]
dipole: -1.6184498 -1.947858 2.0305585 debye
polarizability: 333.6655171|12.1861717|280.509081|8.2688402|17.8438965|235.895488 unknown
InChI: InChI=1S/C17H23Cl6N3O2S/c1-9(16(18,19)20)7-12(14(28)25-11(3)15-24-5-6-29-15)26(4)13(27)8-10(2)17(21,22)23/h5-6,9-12,25H,7-8H2,1-4H3
charge 0 multiplicity 1
52 atoms
Cl 4.284341 2.515022 -1.763092
Cl 6.675211 1.174943 -0.523789
Cl 5.037876 3.137077 1.106613
Cl -4.882742 2.853883 0.911701
Cl -2.773979 4.702331 -0.245905
Cl -4.706527 3.303143 -2.08051
S  -2.229176 -4.935292 -1.058349
O  2.387103 -1.692006 -0.569686
O  -0.204275 0.750113 -0.908019
N  0.267784 0.618767 1.356958
N  0.334742 -2.0372 0.455064
N  -2.278825 -2.783007 0.501954
C  1.594558 0.005503 1.047374
C  2.554759 1.053416 0.424017
C  4.039474 0.598391 0.305274
C  1.463031 -1.294202 0.206873
C  -0.543345 1.009143 0.289866
C  -1.854213 1.741326 0.620363
C  4.926555 1.75977 -0.176534
C  4.584492 -0.022588 1.614384
C  -2.719146 1.907357 -0.655668
C  0.061154 1.028698 2.760033
C  0.053113 -3.270026 -0.300199
C  -3.694545 3.086842 -0.527212
C  -3.435909 0.58195 -1.008932
C  0.892326 -4.471457 0.213397
C  -1.435232 -3.525284 -0.201009
C  -3.786377 -4.381381 -0.354819
C  -3.598589 -3.253114 0.421036
H  2.001956 -0.312698 2.027332
H  2.168216 1.320621 -0.571995
H  2.510606 1.95769 1.064104
H  4.085523 -0.170963 -0.488735
H  -1.60759 2.731218 1.051165
H  -2.43177 1.187832 1.384008
H  4.099344 -1.000001 1.779127
H  4.395765 0.630431 2.485668
H  5.669373 -0.20662 1.548861
H  -2.038541 2.160785 -1.492569
H  0.133064 0.152078 3.429774
H  -0.928871 1.483831 2.898615
H  0.825038 1.768465 3.070871
H  -0.451822 -1.635415 0.977866
H  0.3333 -3.090706 -1.358587
H  -3.964791 0.653231 -1.972725
H  -2.675111 -0.211061 -1.090248
H  -4.162657 0.300954 -0.225585
H  0.649207 -4.692225 1.266835
H  1.961011 -4.2165 0.127656
H  0.697903 -5.374194 -0.393334
H  -4.705614 -4.922318 -0.566655
H  -4.385181 -2.723353 0.958568
